program: Gaussian 09
title: 000234430
version: EM64L-G09RevD.01
frameworkgroup: C1[X(C23H26O2)]
method: RPBEPBE
basis: SDD
operation: Freq
keyword: #pfreq=noraman
keyword: PBEPBE/SDD
title: #p freq=noraman PBEPBE/SDD
converged: YES YES NO NO
title: Mulliken charges:
elementType: O O C C C C C C C C C C C C C C C C C C C C C C C H H H H H H H H H H H H H H H H H H H H H H H H H H
charge: -0.452198 -0.186549 -0.150956 -0.225537 0.228689 0.168119 -0.468452 -0.067740 0.483835 -0.496287 -0.369388 0.298334 -0.369637 -0.435197 -0.399563 -0.693377 -0.380211 -0.411136 -0.226445 -0.236706 -0.701487 -0.247747 -0.236791 -0.249219 -0.244033 0.270442 0.243833 0.223174 0.223769 0.216634 0.204051 0.209655 0.349259 0.242222 0.210862 0.245913 0.234387 0.209283 0.216909 0.219222 0.287453 0.247409 0.225821 0.226687 0.214294 0.210274 0.222751 0.229531 0.227488 0.228275 0.230083
chargesum: 0.00000
title: Mulliken charges with hydrogens summed into heavy atoms:
elementType: O O C C C C C C C C C C C C C C C C C C C C C C C
charge: -0.102939 -0.186549 -0.150956 0.044905 0.228689 0.168119 -0.001445 -0.067740 0.483835 -0.055884 0.044318 0.298334 0.083447 -0.189284 -0.165177 -0.047963 -0.092758 -0.163727 -0.000624 -0.010019 -0.054168 -0.018217 -0.009303 -0.020944 -0.013950
polarizability: 2.53755750e+02 -2.74144928e-02 3.02967771e+02 1.15542175e+01 -1.73571511e+01 2.07357413e+02
1716.lowfreq: -8.4246 -0.0007 -0.0005 0.0004 4.2980 9.0908 21.0496 33.3446 38.4510
frequency: 21.0272 33.3022 38.4037 45.3951 47.8211 61.9550 64.1721 70.7474 79.0229 95.6684 114.5182 133.4205 163.7176 194.5934 216.1517 222.9572 226.3399 241.7201 248.1123 264.5291 268.9690 280.7316 283.2078 293.6646 347.9530 360.2039 383.8794 401.6552 405.8929 408.9603 456.1920 482.0849 507.7391 527.4957 612.4151 616.4358 620.6534 632.9103 654.7867 660.7047 705.1643 707.4928 713.7842 721.4011 738.9110 755.5584 769.3794 774.0611 805.4315 848.7487 852.5108 863.6526 877.2691 879.5888 894.6324 899.4878 924.7562 935.2988 943.9599 977.6545 986.3083 988.9390 989.5612 995.5838 1003.5265 1004.8843 1007.5908 1015.3938 1029.9655 1035.6754 1050.8528 1062.0769 1079.5109 1085.7054 1088.3429 1098.9657 1104.5492 1128.7855 1140.7874 1172.6842 1173.5931 1188.1336 1191.9483 1193.7741 1213.2683 1217.2400 1238.0273 1249.8252 1278.9587 1281.2157 1289.6357 1298.3511 1301.1050 1313.7935 1319.4855 1320.3529 1338.7220 1339.4800 1353.4108 1373.1803 1380.3116 1388.1886 1392.1344 1433.6376 1434.2616 1457.6638 1471.7776 1474.7404 1474.8640 1476.6931 1477.4055 1480.0857 1481.8020 1484.1775 1491.1231 1576.7414 1590.8402 1600.5863 1608.2012 1611.7463 1631.1899 2953.9333 2972.4043 2974.3473 2979.4214 2984.0770 2987.6390 2996.8049 3003.5893 3042.2239 3042.4433 3062.3405 3068.8664 3073.7340 3075.7077 3081.5099 3111.8836 3124.2460 3125.0743 3133.0526 3137.6666 3146.0856 3148.9061 3159.4774 3163.8523 3170.7151 3536.0851
redmass: 4.4161 3.2584 4.1008 4.3848 3.7396 3.4081 1.8358 3.6806 1.7702 4.1485 3.7651 4.0985 3.5445 4.4407 1.2986 2.0429 1.4639 3.9599 3.0523 3.2007 3.2487 2.2957 5.3011 5.3207 1.4077 5.2782 6.4452 3.6054 2.8283 3.0497 4.5067 4.6431 3.6120 3.8101 5.9215 6.4084 5.6227 6.4935 3.4273 4.2310 1.6763 2.0642 2.1517 2.2677 1.2939 1.7120 1.9737 2.1827 2.7620 2.4965 1.2747 1.2603 1.6578 1.6788 2.2852 1.7676 1.5368 1.8476 2.1629 1.3996 1.7811 3.9942 3.3191 1.4661 1.9804 1.7491 2.9485 3.5978 2.1587 2.0245 2.8606 2.7095 1.5812 1.7156 1.9454 1.9458 1.9897 2.0726 2.8825 1.0549 1.0539 1.5057 1.5549 1.1513 1.4210 1.9236 1.4930 1.5600 1.2899 1.4243 1.2092 1.2336 1.4474 1.5051 1.3362 1.6350 2.4345 1.5677 1.5617 6.3634 8.1913 1.2125 1.2128 2.2682 2.2875 1.1104 1.0592 1.0517 1.0421 1.0527 1.0737 2.2120 2.1671 1.0966 1.0877 5.7829 6.1907 10.5768 6.1177 6.1365 10.7306 1.0637 1.0355 1.0364 1.0691 1.0627 1.0731 1.0619 1.0942 1.0974 1.1014 1.0989 1.1000 1.0989 1.0995 1.1021 1.0875 1.0847 1.0857 1.0884 1.0913 1.0939 1.0948 1.0973 1.1012 1.0986 1.0653
irintensity: 0.1581 0.0900 1.3727 0.2600 0.0411 0.3090 0.0292 0.1956 0.7332 1.3261 0.0569 0.4561 2.9072 1.2555 0.0908 0.6341 0.3089 2.0729 0.9986 4.9355 1.9573 48.3353 12.4442 8.2135 55.5236 0.5375 5.0034 5.0202 1.1159 2.3264 4.9631 12.7036 4.0466 12.0527 3.4161 0.1007 11.6275 3.3621 2.6890 7.9441 74.8018 23.0549 4.4256 18.4284 13.3921 15.1365 19.5436 41.8517 9.2617 3.8938 0.6906 2.7912 5.2952 6.6935 3.2546 2.8724 1.9608 7.2202 33.5677 0.5744 2.3650 0.6082 1.4220 0.5922 29.8989 3.1928 20.1376 24.6148 4.9486 8.7356 0.6395 11.4041 4.5677 15.1798 16.4334 3.8262 10.8122 12.5110 28.3021 0.1136 0.0637 3.8353 7.0603 2.1043 5.1845 11.9026 12.7074 10.3455 17.1647 13.1060 15.6566 4.4065 12.8214 8.2146 10.9716 41.4651 68.6154 25.7073 0.0972 7.9104 1.0510 9.9962 11.7431 18.9794 2.4139 6.3125 0.8850 3.6721 12.5567 12.0996 4.3701 13.5488 5.3561 14.6558 18.4967 9.9260 0.8108 277.0361 1.1846 3.4450 49.7286 39.2760 44.0049 34.4466 12.4746 4.9437 21.8323 35.1454 7.7726 1.2290 15.2213 4.1608 61.4137 44.6071 37.7329 59.5914 9.6667 0.8909 0.2212 6.7099 15.0422 28.5747 24.0626 19.6091 24.2969 19.8424 9.8843
temp: 298.150 k
press: 1.00000 atm
elementType: 8 8 6 6 6 6 6 6 6 6 6 6 6 6 6 6 6 6 6 6 6 6 6 6 6 1 1 1 1 1 1 1 1 1 1 1 1 1 1 1 1 1 1 1 1 1 1 1 1 1 1
symmnumber: 1
zpe: 1116093.7 jmol-1
zpe.correction: 0.425098 hartree
zpe.thermalcorrener: 0.449726 hartree
zpe.thermalcorrenthalpy: 0.450670 hartree
zpe.thermalcorrgfe: 0.369103 hartree
zpe.sumelectzpe: -1040.669676 hartree
zpe.sumelectthermal: -1040.645048 hartree
zpe.sumelectthermalent: -1040.644103 hartree
zpe.sumelectthermalfe: -1040.725671 hartree
dipole: -1.3694 3.1221 -0.3037
dipole: 3.4227
quadrupole: -138.5913 -153.4918 -142.6764
quadrupole: 3.8475 4.3441 4.1678
quadrupole: 6.3285 -8.5719 2.2434 3.8475 4.3441 4.1678
hfenergy: -1041.0947736 hartree
pointgroup: C01 [X(C23H26O2)]
dipole: 0.5192595 1.2305246 0.1718242 debye
polarizability: 250.1900056|-1.9624778|303.3391034|16.9364544|16.2015315|210.5518246 unknown
InChI: InChI=1S/C23H26O2/c1-3-11-19-21(17-13-7-5-8-14-17)23(25,18-15-9-6-10-16-18)20(12-4-2)22(19)24/h5-10,13-16,20,25H,3-4,11-12H2,1-2H3
charge 0 multiplicity 1
51 atoms
O  0.587233 -0.376842 1.870867
O  -0.32091 -3.47245 -1.151921
C  0.677852 -0.2878 0.392391
C  1.117928 -1.664305 -0.229852
C  -0.790166 -0.113333 -0.088039
C  -1.276672 -1.268472 -0.663967
C  1.927074 -2.625523 0.668304
C  -0.197421 -2.288619 -0.726927
C  1.586247 0.880456 -0.036096
C  -2.675975 -1.618135 -1.105859
C  3.381716 -2.170411 0.935125
C  -1.511016 1.164867 0.103133
C  -3.360635 -2.602918 -0.111036
C  2.223119 1.715775 0.911894
C  1.786091 1.14445 -1.416606
C  4.164352 -3.184549 1.795992
C  -1.40417 1.888501 1.324677
C  -2.303204 1.715043 -0.945385
C  3.064397 2.772158 0.493165
C  2.618371 2.202588 -1.837494
C  -4.778896 -2.991449 -0.576782
C  3.269301 3.018599 -0.882251
C  -2.094289 3.106118 1.499135
C  -2.980752 2.939635 -0.772229
C  -2.886214 3.637559 0.454505
H  1.732283 -1.456479 -1.129659
H  1.946041 -3.604932 0.151879
H  1.388569 -2.797145 1.621494
H  -3.305407 -0.71696 -1.203407
H  -2.630926 -2.111705 -2.097127
H  3.405559 -1.174182 1.426156
H  3.89682 -2.027821 -0.036264
H  1.466823 -0.680712 2.215307
H  -2.733891 -3.508194 -0.016588
H  -3.406731 -2.12999 0.88922
H  2.043015 1.553094 1.979685
H  1.276443 0.529495 -2.169557
H  3.684929 -3.326532 2.783102
H  4.203057 -4.172647 1.300546
H  5.203826 -2.851257 1.968819
H  -0.796951 1.4684 2.13175
H  -2.35236 1.200121 -1.911204
H  3.551343 3.407055 1.242164
H  2.757434 2.393479 -2.907624
H  -4.748588 -3.49138 -1.563221
H  -5.429374 -2.100836 -0.668159
H  -5.256015 -3.686079 0.138502
H  3.918333 3.839359 -1.207091
H  -2.01205 3.643038 2.450809
H  -3.575129 3.352996 -1.594753
H  -3.41602 4.587074 0.590479
