program: Gaussian 09
title: 000234351
version: EM64L-G09RevD.01
frameworkgroup: C1[X(C8H8OS)]
method: RPBEPBE
basis: SDD
operation: Freq
keyword: #pfreq=noraman
keyword: PBEPBE/SDD
title: #p freq=noraman PBEPBE/SDD
converged: NO YES NO NO
title: Mulliken charges:
elementType: S O C C C C C C C C H H H H H H H H
charge: 0.334388 -0.204073 -0.174831 -0.547601 0.491195 0.166774 -0.530106 -0.716330 -0.272193 -0.499096 0.252552 0.240536 0.242329 0.217408 0.218552 0.252903 0.260694 0.266898
chargesum: 0.00000
title: Mulliken charges with hydrogens summed into heavy atoms:
elementType: S O C C C C C C C C
charge: 0.334388 -0.204073 0.077721 -0.064735 0.491195 0.166774 -0.530106 -0.027466 -0.011499 -0.232198
polarizability: 1.34626954e+02 -5.54979542e+00 1.11093055e+02 -4.21387198e+00 -7.55049029e-01 5.41447409e+01
1716.lowfreq: -11.4533 -7.9330 -2.2227 -0.0030 -0.0014 0.0006 48.6708 133.6275 201.1640
frequency: 48.6611 133.6249 201.1632 213.8150 237.9055 256.0761 352.2359 441.6407 483.4948 510.6486 543.5392 596.9919 630.8672 668.1814 721.8227 747.1150 781.6613 839.3647 887.9479 911.4657 919.3294 989.3371 1038.5285 1090.4899 1102.4528 1114.0760 1175.0026 1200.0109 1228.2449 1255.3433 1279.1600 1292.3078 1385.2831 1386.8098 1452.4981 1461.9084 1471.5362 1479.3089 1531.4927 1629.9593 2982.7268 2989.1228 2992.9438 3043.5389 3079.0422 3091.5904 3178.3245 3228.6868
redmass: 3.2477 5.6648 2.9517 1.2286 4.0099 4.0732 2.6771 5.0657 6.9153 3.5955 4.9085 3.4606 6.6916 8.3982 2.0952 1.7877 4.9716 3.4306 1.3306 1.8741 1.8324 3.0062 1.6911 1.5189 1.6313 1.7306 1.3909 1.5411 1.6883 2.5619 1.4652 1.8622 3.5472 1.3284 1.2433 4.7242 1.0465 1.0523 5.2373 12.2405 1.0360 1.0736 1.0699 1.1011 1.1005 1.0998 1.0922 1.0997
irintensity: 0.9542 0.4527 1.7540 0.7147 2.6266 6.4907 0.7755 2.5997 1.4187 3.9215 5.4236 7.3433 1.8629 5.4179 17.4850 53.6539 6.6452 35.5495 2.6876 10.2512 26.7696 2.2485 0.3794 4.7424 5.5157 2.1281 1.4507 14.1496 3.5833 34.2633 5.3445 12.2249 6.6451 14.2900 15.4072 66.8961 13.7348 10.1531 5.6890 308.3395 27.6343 21.8328 13.5819 16.0117 36.2278 15.0362 3.6949 0.5734
temp: 298.150 k
press: 1.00000 atm
elementType: 16 8 6 6 6 6 6 6 6 6 1 1 1 1 1 1 1 1
symmnumber: 1
zpe: 360538.2 jmol-1
zpe.correction: 0.137322 hartree
zpe.thermalcorrener: 0.146239 hartree
zpe.thermalcorrenthalpy: 0.147183 hartree
zpe.thermalcorrgfe: 0.102842 hartree
zpe.sumelectzpe: -782.198743 hartree
zpe.sumelectthermal: -782.189826 hartree
zpe.sumelectthermalent: -782.188882 hartree
zpe.sumelectthermalfe: -782.233222 hartree
dipole: -1.2262 4.5962 -0.0316
dipole: 4.7570
quadrupole: -58.5551 -69.9395 -66.7759
quadrupole: 3.5651 -0.9809 -0.7168
quadrupole: 6.5350 -4.8494 -1.6857 3.5651 -0.9809 -0.7168
hfenergy: -782.3360649 hartree
pointgroup: C01 [X(C8H8O1S1)]
dipole: 0.7690023 1.7046749 0.0736396 debye
dipolederiv: -0.0321773 0.0384135 0.0093038 0.0441733 -0.2438572 -0.028448 0.0219773 -0.0323987 0.1763914 -0.7596347 -0.2562891 0.0099599 -0.4366213 -0.9321117 -0.0018458 -0.007761 -0.0306724 -0.3245733 -0.116701 0.2150701 0.0007919 0.1390796 -0.2116286 -0.0315647 0.0036733 -0.0759399 0.1073785 -0.0796442 -0.0012654 -0.0062392 0.0245791 -0.0373594 0.0054209 -0.0198305 0.032478 0.1726578 0.3382865 -0.176952 -0.0297236 0.1955433 0.0798661 -0.0230322 -0.0021342 -0.0038339 -0.0166241 1.4928431 0.3744944 -0.0717547 0.4204284 1.0102652 0.0251984 -0.1017341 0.0854157 0.1522046 -0.6160793 -0.554724 -0.0119281 -0.4963746 -0.0898643 0.0417068 -0.0059623 0.0430547 -0.1652273 0.0472683 -0.0577632 -0.0499423 0.0229411 0.0482519 0.0098284 0.0210488 -0.0263271 0.0642246 -0.3372846 0.2556288 0.0178917 0.2322603 -0.1178742 -0.0079856 0.03392 -0.0139791 -0.147193 -0.1394437 0.0755274 -0.0126926 -0.0999024 0.3982099 0.0489081 -0.0138317 0.0380262 -0.2816444 0.0294977 -0.0092674 0.0481714 0.0166243 0.0598254 0.0074293 0.0553384 0.0161306 -0.0970179 0.0379592 0.0314464 0.0015561 0.0044122 -0.0082566 -0.0955066 0.0109934 -0.1407405 -0.0305013 0.0387565 0.0661067 -0.0188511 0.0330643 0.0025794 0.0736666 -0.0256109 0.1234208 -0.0331615 -0.0197335 0.1013806 -0.0034259 0.1595594 -0.0835163 -0.0311192 -0.0047217 -0.0456907 0.0631254 0.0405869 -0.0099235 0.103693 0.0006942 0.0827234 0.0210745 0.0232404 0.0258377 -0.1265459 0.004605 -0.0633771 -0.0080885 -0.1566886 -0.0048167 0.0015665 -0.0024518 0.0254454 0.0921287 0.0840866 -0.0274415 0.0061173 -0.0843256 -0.0378629 -0.0089062 0.0019531 -0.0119813 0.1902998 -0.0131915 -0.0010648 0.015161 -0.0194467 0.0854267 -0.0063916 0.0118935 -0.0082455 0.204078 unknown
polarizability: 135.9133297|1.5248886|109.8169128|-2.3573122|2.9575237|54.1345079 unknown
InChI: InChI=1S/C8H8OS/c1-5-4-6-2-3-10-8(6)7(5)9/h2-3,5H,4H2,1H3
charge 0 multiplicity 1
18 atoms
S  1.909935 -1.533193 -0.147944
O  -1.593754 -1.971913 0.041308
C  -1.72041 0.518988 0.318203
C  -0.600506 1.611047 0.21188
C  0.684498 0.814814 0.092766
C  -1.009531 -0.857516 0.112513
C  0.420384 -0.553627 0.028533
C  -2.897129 0.696998 -0.664242
C  2.081669 1.130321 0.007697
C  2.869035 -0.010406 -0.123623
H  -2.124716 0.50391 1.350576
H  -0.591129 2.286427 1.087233
H  -0.756804 2.24693 -0.680815
H  -3.46629 1.61698 -0.439076
H  -2.535193 0.760369 -1.706895
H  -3.581705 -0.166316 -0.594199
H  2.497263 2.140021 0.039012
H  3.953184 -0.077835 -0.208626
