program: Gaussian 09
title: 000234327
version: EM64L-G09RevD.01
frameworkgroup: C1[X(C13H16O6)]
method: RPBEPBE
basis: SDD
operation: Freq
keyword: #pfreq=noraman
keyword: PBEPBE/SDD
title: #p freq=noraman PBEPBE/SDD
converged: YES YES NO NO
title: Mulliken charges:
elementType: O O O O O O C C C C C C C C C C C C C H H H H H H H H H H H H H H H H
charge: -0.276081 -0.279050 -0.414661 -0.413726 -0.224660 -0.205704 -0.206223 0.467388 -0.010461 -0.706034 -0.717811 -0.415668 0.301293 -0.273204 -0.363436 -0.378937 -0.394004 0.210982 0.195199 0.253260 0.228268 0.207979 0.212553 0.261595 0.206228 0.196021 0.236707 0.222600 0.234503 0.261043 0.288861 0.276805 0.251152 0.380653 0.386571
chargesum: 0.00000
title: Mulliken charges with hydrogens summed into heavy atoms:
elementType: O O O O O O C C C C C C C C C C C C C
charge: -0.276081 -0.279050 -0.034008 -0.027155 -0.224660 -0.205704 0.047037 0.467388 -0.010461 -0.057234 -0.053967 -0.178961 0.301293 -0.050604 -0.128933 0.170967 0.133953 0.210982 0.195199
polarizability: 1.98339319e+02 1.31724235e+00 1.62655046e+02 8.69481848e+00 1.20368512e+01 1.21117291e+02
1716.lowfreq: -8.0811 -7.0971 -2.6880 -0.0010 -0.0006 -0.0001 17.9757 26.8061 32.5798
frequency: 17.4216 26.5134 32.4694 37.8266 44.5385 52.4294 70.3571 78.0278 150.1856 167.4932 182.1621 202.0757 216.8806 235.9242 261.3849 269.8102 282.4134 293.9445 316.0120 360.9398 406.2280 444.8045 458.0550 475.7812 486.8026 496.2451 523.1665 552.0986 577.1353 597.8956 610.5573 622.1739 632.0578 638.8623 657.9852 743.3380 775.5418 788.9406 826.6859 833.1206 838.2776 873.7148 920.8229 925.1185 955.0344 959.1322 989.0358 1001.1879 1014.9312 1030.3065 1045.4402 1056.0659 1070.2768 1101.3027 1116.6963 1156.0636 1168.7044 1185.6141 1212.5032 1232.5861 1243.0089 1256.4991 1262.1388 1273.4105 1318.9042 1323.8573 1349.5424 1357.3950 1372.8940 1382.5545 1393.1919 1438.7178 1449.5136 1453.8512 1457.8122 1465.9201 1469.3884 1479.2184 1489.3097 1585.4973 1604.0402 1682.8787 1686.8316 2970.8519 2975.3560 3012.8513 3017.4562 3041.6854 3060.4039 3074.6856 3078.1632 3079.9857 3091.6345 3097.3010 3129.2281 3145.0187 3163.7438 3516.7759 3516.8772
redmass: 8.2977 4.9529 5.1999 7.1477 7.9034 3.3415 6.6424 5.2147 3.3082 3.4528 4.1688 4.5265 1.0891 1.2413 2.7969 4.5640 3.5396 4.6773 3.6863 5.3379 3.3258 3.0189 4.1661 2.4138 2.3199 3.2558 4.9410 3.6615 3.5776 4.6163 2.8415 1.9747 2.8594 1.7006 4.2510 1.6772 5.0577 2.9932 4.6475 4.6947 4.1895 1.4068 1.5732 1.7763 1.4234 1.3381 6.4620 2.3803 2.2286 2.9412 2.5088 1.8441 3.2999 1.9949 2.6500 2.9317 1.9165 1.2421 1.2249 1.1843 1.6974 1.6707 1.9691 2.1382 1.3964 1.5724 1.6025 1.5488 1.1934 3.1117 1.3746 1.2184 1.2799 2.1845 1.8281 1.0537 1.0463 1.0622 1.0937 6.3607 7.4180 8.7780 8.9909 1.0349 1.0361 1.0601 1.0597 1.0873 1.0996 1.0977 1.0979 1.1014 1.1014 1.0991 1.0856 1.0913 1.0987 1.0643 1.0643
irintensity: 0.9534 0.7853 0.5614 0.9938 0.5549 0.3905 2.4150 0.8961 1.7185 2.7166 0.7143 2.0869 0.2677 0.3354 0.2751 4.0264 1.8229 1.2651 2.6876 2.3020 3.7434 27.0135 24.7495 44.0372 28.0839 5.3739 5.7247 10.9882 21.9130 11.8743 37.0330 75.6885 67.5543 84.6384 27.4145 47.0107 9.4450 25.3254 0.9038 9.7902 6.9238 0.4692 5.2623 6.8667 0.3929 0.4152 258.9003 131.7904 6.3889 364.5410 156.9458 20.4744 21.0167 11.5953 3.8258 35.8234 12.5371 6.3095 12.0766 17.6905 93.2989 7.9599 18.0150 31.2480 6.4259 4.4787 34.1843 16.6516 17.4772 5.4676 16.5205 8.9349 69.9631 55.4131 49.3592 5.1255 2.2829 3.5785 26.8656 28.3905 17.6802 220.3448 171.5554 31.5974 48.5059 36.2327 36.8162 7.3542 1.8364 81.6502 38.7143 5.0670 2.0816 19.6170 2.4005 24.3040 19.0872 22.4680 35.1063
temp: 298.150 k
press: 1.00000 atm
elementType: 8 8 8 8 8 8 6 6 6 6 6 6 6 6 6 6 6 6 6 1 1 1 1 1 1 1 1 1 1 1 1 1 1 1 1
symmnumber: 1
zpe: 712181.8 jmol-1
zpe.correction: 0.271256 hartree
zpe.thermalcorrener: 0.291088 hartree
zpe.thermalcorrenthalpy: 0.292032 hartree
zpe.thermalcorrgfe: 0.219686 hartree
zpe.sumelectzpe: -954.869289 hartree
zpe.sumelectthermal: -954.849457 hartree
zpe.sumelectthermalent: -954.848513 hartree
zpe.sumelectthermalfe: -954.920859 hartree
dipole: 3.5454 -0.2610 -0.2639
dipole: 3.5648
quadrupole: -95.4831 -101.0855 -112.1062
quadrupole: -3.3539 -0.9602 2.0311
quadrupole: 7.4085 1.8061 -9.2147 -3.3539 -0.9602 2.0311
hfenergy: -955.1405451 hartree
pointgroup: C01 [X(C13H16O6)]
dipole: 1.2285534 -0.6365001 -0.22916 debye
polarizability: 195.3272847|-11.6131346|166.5344739|6.2248564|10.3741226|120.2498985 unknown
InChI: InChI=1S/C13H16O6/c1-8(2)9-4-3-5-10(18-6-11(14)15)13(9)19-7-12(16)17/h3-5,8,14,16H,6-7H2,1-2H3
charge 0 multiplicity 1
35 atoms
O  -0.472056 1.049575 1.145058
O  1.531285 -0.80826 0.743165
O  1.235454 3.793475 -0.625711
O  4.100087 -2.61271 -1.158133
O  -0.839373 2.843487 -1.083967
O  3.078661 -0.577025 -1.659992
C  -3.161766 0.710762 0.155204
C  -2.049429 -0.298916 -0.134338
C  -0.730535 -0.094331 0.344339
C  -4.201958 0.105825 1.137371
C  -3.839375 1.20793 -1.147222
C  -2.316518 -1.485161 -0.867791
C  0.282312 -1.072529 0.120398
C  -1.305343 -2.427622 -1.130543
C  0.003977 -2.228976 -0.636404
C  0.613672 1.932577 0.729933
C  2.620646 -1.72947 0.498929
C  0.208747 2.861043 -0.411479
C  3.245046 -1.5367 -0.886567
H  -2.694836 1.582911 0.643156
H  -3.723973 -0.207829 2.082993
H  -4.701462 -0.778391 0.698042
H  -4.982077 0.85301 1.374873
H  -3.096237 1.689193 -1.804901
H  -4.622539 1.950916 -0.905645
H  -4.322282 0.381327 -1.701989
H  -3.328761 -1.658521 -1.248731
H  -1.5271 -3.325719 -1.716763
H  0.777046 -2.974989 -0.844813
H  0.863743 2.541951 1.61419
H  1.514332 1.366362 0.430846
H  3.385591 -1.486906 1.257059
H  2.32808 -2.786545 0.637806
H  0.992894 4.386337 -1.387629
H  4.557545 -2.470678 -2.030948
