program: Gaussian 09
title: 000234322
version: EM64L-G09RevD.01
frameworkgroup: C1[X(C2HF2NO4)]
method: RPBEPBE
basis: SDD
operation: Freq
keyword: #p
keyword: freq=noraman
keyword: PBEPBE/SDD
title: #p freq=noraman PBEPBE/SDD
converged: NO YES NO NO
title: Mulliken charges:
elementType: F F O O O O N C C H
charge: -0.115814 -0.120628 -0.389685 -0.149863 -0.158149 -0.121224 0.108778 0.347888 0.183431 0.415267
chargesum: 0.00000
title: Mulliken charges with hydrogens summed into heavy atoms:
elementType: F F O O O O N C C
charge: -0.115814 -0.120628 0.025581 -0.149863 -0.158149 -0.121224 0.108778 0.347888 0.183431
polarizability: 5.40638579e+01 -9.63644573e-01 3.94536396e+01 -8.95358599e+00 9.48496382e-01 4.25026375e+01
1716.lowfreq: -8.3311 -4.4465 -0.0004 0.0008 0.0010 9.9999 33.0299 68.8645 143.8421
frequency: 32.9225 68.8613 143.8420 217.5563 232.6642 308.6721 342.5375 395.7529 420.5978 515.3231 581.5762 633.9436 656.2149 705.6984 740.4167 895.4282 1020.7265 1081.1516 1131.2271 1194.2489 1312.0095 1455.6125 1695.8749 3537.3530
redmass: 15.3327 12.7961 9.6617 10.8046 17.3678 14.8378 13.7872 15.5205 7.6075 4.4700 1.7608 3.8515 8.3944 9.7378 13.2887 10.7917 4.0955 12.6186 3.7140 11.4248 2.7547 14.5938 11.6612 1.0650
irintensity: 0.0630 1.8962 2.9111 0.9545 1.7593 1.9325 0.9171 2.6703 7.8324 30.4016 90.9778 110.6827 11.8577 12.7676 37.2348 35.0582 302.7033 125.1459 38.7796 76.4325 14.3728 182.5767 238.6240 75.6353
temp: 298.150 k
press: 1.00000 atm
elementType: 9 9 8 8 8 8 7 6 6 1
symmnumber: 1
zpe: 115560.5 jmol-1
zpe.correction: 0.044015 hartree
zpe.thermalcorrener: 0.052635 hartree
zpe.thermalcorrenthalpy: 0.053579 hartree
zpe.thermalcorrgfe: 0.009287 hartree
zpe.sumelectzpe: -631.338198 hartree
zpe.sumelectthermal: -631.329578 hartree
zpe.sumelectthermalent: -631.328634 hartree
zpe.sumelectthermalfe: -631.372926 hartree
dipole: 2.3175 -1.3048 1.5818
dipole: 3.0945
quadrupole: -50.5328 -48.0788 -51.9995
quadrupole: -6.3839 6.2296 -2.7308
quadrupole: -0.3291 2.1249 -1.7958 -6.3839 6.2296 -2.7308
hfenergy: -631.3822128 hartree
pointgroup: C01 [X(C2H1F2N1O4)]
dipole: -0.9541594 -0.7397654 0.1566311 debye
dipolederiv: -0.2735744 -0.0073343 0.0090646 -0.0776845 -0.3385476 -0.1659024 -0.0731509 -0.1860993 -0.6919053 -0.275776 -0.0879926 -0.0061678 -0.01036 -0.6843089 0.0920994 -0.0221571 0.1021907 -0.282784 -0.352431 -0.1540971 -0.0255779 -0.1325554 -1.1606186 0.1294785 -0.0287138 0.2032292 -0.3616753 -0.6842846 0.3322754 0.060737 0.0873871 -0.6987047 0.0686946 0.2070114 -0.0774823 -0.2791102 -0.4507028 0.083727 -0.0463828 0.1321774 -0.2194751 -0.0844174 0.0556649 -0.1408272 -0.6900572 -0.6377596 0.2141744 0.1939529 0.2713709 -0.239314 -0.136422 0.0439995 -0.0625979 -0.4559525 0.9485078 -0.3314798 -0.1519151 -0.5089153 0.2269261 0.2500723 -0.0145173 0.2326672 0.9980829 0.5151756 0.1226945 0.0625053 0.1936615 1.2546494 0.0155838 0.1170953 0.059458 1.1583783 0.9931204 -0.219555 -0.1869258 -0.0258408 1.4847438 -0.1507856 -0.3863028 -0.1177984 0.2389365 0.2177246 0.0475875 0.0907095 0.0707591 0.3746496 -0.0184012 0.1010707 -0.01274 0.3660868 unknown
polarizability: 52.1537639|-7.5658268|41.6768586|-6.462226|2.7404128|42.1895126 unknown
InChI: InChI=1S/C2HF2NO4/c3-2(4,1(6)7)5(8)9/h6H
charge 0 multiplicity 1
10 atoms
F  0.066161 -0.335518 -1.731762
F  0.093021 1.693031 -0.706763
O  -1.377227 -1.371676 0.478227
O  -2.235571 0.811204 0.507975
O  1.093948 0.170567 1.627766
O  2.198746 -0.671421 -0.199135
N  1.220125 -0.117346 0.386515
C  -0.030952 0.315988 -0.499314
C  -1.358224 -0.014391 0.229785
H  -2.208226 -1.64734 0.950507
