program: Gaussian 09
title: 000234316
version: EM64L-G09RevD.01
frameworkgroup: C1[X(C15H24N4O2)]
method: RPBEPBE
basis: SDD
operation: Freq
keyword: #p
keyword: freq=noraman
keyword: PBEPBE/SDD
title: #p freq=noraman PBEPBE/SDD
converged: YES YES NO NO
title: Mulliken charges:
elementType: O O N N N N C C C C C C C C C C C C C C C H H H H H H H H H H H H H H H H H H H H H H H H
charge: -0.244977 -0.283051 -0.173239 -0.458314 -0.403163 -0.503239 -0.477336 -0.314201 -0.320998 0.162473 0.370584 0.371842 0.149290 -0.602493 -0.574336 0.350200 -0.671069 -0.694173 -0.840105 -0.832065 0.117547 0.243482 0.239599 0.210330 0.197700 0.203866 0.225031 0.357004 0.279525 0.222747 0.214629 0.222672 0.218867 0.223536 0.213738 0.232575 0.237036 0.244588 0.221180 0.295677 0.216517 0.216291 0.326428 0.302218 0.305588
chargesum: 0.00000
title: Mulliken charges with hydrogens summed into heavy atoms:
elementType: O O N N N N C C C C C C C C C C C C C C C
charge: -0.244977 -0.283051 -0.173239 -0.101310 -0.076734 0.104566 0.005744 0.093829 0.107899 0.162473 0.370584 0.371842 0.149290 -0.322968 -0.351589 0.350200 -0.014902 -0.024325 -0.137301 -0.103579 0.117547
polarizability: 2.98041476e+02 -5.11556098e+00 2.01065321e+02 -7.22035580e+00 8.87329683e-01 1.36312114e+02
1716.lowfreq: -18.7598 -16.4113 -6.0570 0.0007 0.0008 0.0009 6.1544 23.3202 33.0587
frequency: -15.8304 21.7191 32.9775 44.9964 49.3652 72.5176 86.2833 97.0477 102.6280 108.0987 120.5946 132.9046 165.9306 170.5634 186.7938 198.8097 208.8348 214.2443 235.2110 250.1996 265.0592 281.7537 294.4169 298.7635 319.1991 354.6727 368.5387 394.2765 408.8276 447.3393 489.7484 510.6006 516.6139 520.6766 539.9174 556.6744 563.5759 591.0083 614.6014 720.7706 742.3708 760.1253 770.9348 793.6194 797.5494 801.4408 834.3346 838.2075 882.2025 898.0177 919.1193 927.6134 951.5121 963.1632 985.9244 994.5071 1001.1854 1043.4988 1049.7851 1055.1369 1065.2798 1073.7983 1087.7254 1093.2448 1111.8865 1154.1418 1161.0470 1182.9012 1197.7424 1235.2326 1246.4291 1248.6997 1281.0348 1282.7125 1287.7125 1287.8956 1322.7635 1326.8117 1362.5873 1368.9033 1374.5843 1390.3835 1392.0701 1398.3739 1400.5274 1411.5887 1432.0826 1446.9382 1451.5235 1454.6906 1463.3693 1470.1164 1471.1269 1473.1075 1477.1429 1477.8986 1482.9544 1488.2674 1492.2776 1498.4796 1573.0679 1603.0658 1613.1524 1635.4070 1681.8287 2888.0028 2894.4629 2964.6844 2964.9937 2976.1782 2985.4176 2989.8803 3020.0859 3041.3530 3046.1507 3050.4108 3058.5555 3080.2336 3083.0637 3085.9040 3090.5450 3092.0203 3093.8233 3120.1785 3149.9439 3257.2303 3381.4062 3493.5773 3569.8252
redmass: 3.0658 3.6520 4.5715 4.6385 4.1175 2.2541 1.8739 3.1727 4.9228 2.2645 1.6251 3.4312 1.3503 1.4350 1.5181 1.5519 2.8765 1.6478 2.2851 2.4308 4.0569 2.2827 2.6146 2.7025 3.4493 5.0799 3.3650 3.8639 4.7386 2.6770 4.1263 2.5723 3.8873 2.8445 2.3872 2.7155 3.7050 2.9990 4.0065 4.8653 3.3979 2.5390 3.7437 1.6981 1.1994 1.4118 1.1865 4.0795 1.4672 2.0496 3.6158 1.5527 5.2626 2.6168 1.9067 2.2755 1.7391 1.7850 1.5668 1.6483 2.6125 1.9564 2.1016 2.3898 1.9373 1.9765 2.5949 2.3814 2.3516 2.3678 1.7462 1.3727 1.2331 1.6727 1.1671 1.1821 3.8148 1.4040 1.3256 1.3901 6.0123 1.2270 1.2361 1.3517 1.2578 2.6348 1.9027 1.0813 1.2009 1.4374 1.1751 1.0570 1.0520 1.1093 1.1121 1.2426 1.0893 1.2305 1.1088 1.6626 7.3563 7.8312 5.6367 7.6598 1.0608 1.0710 1.0710 1.0439 1.0615 1.0367 1.0358 1.0361 1.0900 1.0941 1.0951 1.0896 1.0965 1.0987 1.0975 1.0999 1.1006 1.0993 1.0983 1.0910 1.0920 1.0757 1.0428 1.0980 1.0790
irintensity: 0.2005 0.7653 1.5369 1.2172 1.2869 0.4349 0.2920 3.3639 4.7657 7.3633 14.2250 4.4970 1.0835 2.4438 1.2297 1.6927 4.9930 1.4100 1.2962 3.3646 24.5954 1.7721 7.5525 5.3297 3.9043 8.9441 0.2140 9.8406 16.5329 2.4774 7.0145 24.0103 10.9760 31.4581 53.3923 27.9402 7.6014 24.9245 8.5390 4.7645 9.3080 9.9219 4.3153 129.2449 12.1858 16.9469 60.5961 37.5983 9.1627 13.9547 10.8735 12.5453 2.6784 15.8894 13.3652 14.3148 5.3599 6.1370 5.5654 10.6761 25.9156 22.1629 5.4874 1.2510 21.3211 10.1553 35.1997 15.2272 29.6996 6.1432 62.7269 18.9347 20.8010 20.2844 0.4805 15.9312 66.6280 5.0996 3.3534 32.7100 31.4115 16.3984 24.5181 16.5173 18.3063 38.1122 40.4007 14.0638 152.5061 239.0689 67.2789 31.5213 16.0354 67.8043 10.5428 97.1944 16.1050 114.6732 14.6108 134.9607 106.1628 78.8295 47.5474 170.8462 31.5815 29.0556 184.7137 42.0858 41.0639 25.5304 21.7502 22.7366 16.7443 17.8023 7.3996 10.2537 13.9497 24.0278 77.3936 14.9219 35.4666 64.5444 10.0603 19.8642 1.1525 359.0204 0.2869 1.4422 27.2821
temp: 298.150 k
press: 1.00000 atm
elementType: 8 8 7 7 7 7 6 6 6 6 6 6 6 6 6 6 6 6 6 6 6 1 1 1 1 1 1 1 1 1 1 1 1 1 1 1 1 1 1 1 1 1 1 1 1
symmnumber: 1
zpe: 989177.1 jmol-1
zpe.correction: 0.376758 hartree
zpe.thermalcorrener: 0.399807 hartree
zpe.thermalcorrenthalpy: 0.400751 hartree
zpe.thermalcorrgfe: 0.323573 hartree
zpe.sumelectzpe: -953.834348 hartree
zpe.sumelectthermal: -953.811299 hartree
zpe.sumelectthermalent: -953.810354 hartree
zpe.sumelectthermalfe: -953.887533 hartree
dipole: 5.3666 0.2877 3.1525
dipole: 6.2307
quadrupole: -114.1993 -128.0264 -133.4849
quadrupole: 12.5597 2.7102 -5.0746
quadrupole: 11.0375 -2.7895 -8.2480 12.5597 2.7102 -5.0746
hfenergy: -954.2111057 hartree
pointgroup: C01 [X(C15H24N4O2)]
dipole: 2.1700569 -1.0940805 -0.320872 debye
polarizability: 295.9658305|17.0613075|142.7445568|-6.975541|-18.0227547|196.708524 unknown
InChI: InChI=1S/C15H24N4O2/c1-5-19(6-2)9-13(20)17-14-10(3)7-12(8-11(14)4)15(21)18-16/h7-8,17-18H,5-6,9,16H2,1-4H3
charge 0 multiplicity 1
45 atoms
O  1.442381 2.48942 -1.497843
O  -4.678234 -0.493549 1.855911
N  3.994457 0.152229 -0.216922
N  1.324287 0.351574 -0.483437
N  -5.159276 -0.64915 -0.405379
N  -6.546178 -0.882784 -0.194036
C  3.502772 1.187355 -1.167226
C  5.037275 -0.74334 -0.802741
C  4.406697 0.78003 1.078781
C  -0.0748 0.180377 -0.253638
C  -0.491132 -0.227942 1.052731
C  -1.027313 0.363677 -1.301908
C  1.977955 1.428372 -1.062821
C  -1.862682 -0.426652 1.301123
C  -2.396057 0.164711 -1.002269
C  -2.829268 -0.232928 0.285651
C  4.465708 -1.729058 -1.838165
C  4.533043 -0.215787 2.245191
C  0.525386 -0.432405 2.161076
C  -0.612607 0.714274 -2.715159
C  -4.269878 -0.45639 0.651406
H  4.001429 2.170262 -1.034895
H  3.702308 0.866986 -2.206402
H  5.481971 -1.322987 0.02468
H  5.8649 -0.147274 -1.257857
H  5.364425 1.342152 0.955959
H  3.63255 1.528994 1.332046
H  2.014666 -0.312795 -0.079255
H  -2.214121 -0.717275 2.296731
H  -3.120116 0.351912 -1.80456
H  4.023271 -1.212927 -2.709384
H  3.682345 -2.358369 -1.380379
H  5.267523 -2.388939 -2.217028
H  4.738678 0.33267 3.182438
H  5.355977 -0.93776 2.100455
H  3.595555 -0.783818 2.376297
H  1.184078 0.449286 2.271505
H  0.02138 -0.608731 3.125346
H  1.179342 -1.306257 1.966592
H  -0.269162 1.762419 -2.775629
H  0.23612 0.086294 -3.046857
H  -1.448489 0.564407 -3.419559
H  -4.8421 -0.773522 -1.366174
H  -6.998555 -0.024273 0.153663
H  -6.670215 -1.641188 0.494039
