program: Gaussian 09
title: 000234288
version: EM64L-G09RevD.01
frameworkgroup: C1[X(C10H11Cl3O2)]
method: RPBEPBE
basis: SDD
operation: Freq
keyword: #p
keyword: freq=noraman
keyword: PBEPBE/SDD
title: #p freq=noraman PBEPBE/SDD
converged: YES YES NO NO
title: Mulliken charges:
elementType: Cl Cl Cl O O C C C C C C C C C C H H H H H H H H H H H
charge: -0.025736 -0.071724 -0.059920 -0.257380 -0.294625 -0.225961 -0.344604 0.456148 -0.233186 -0.283641 -0.302297 -0.541002 -0.203411 -0.231452 -0.103582 0.224395 0.216720 0.239746 0.224661 0.217694 0.229828 0.294248 0.277915 0.262744 0.280013 0.254410
chargesum: 0.00000
title: Mulliken charges with hydrogens summed into heavy atoms:
elementType: Cl Cl Cl O O C C C C C C C C C C
charge: -0.025736 -0.071724 -0.059920 -0.257380 -0.294625 0.215153 0.119803 0.456148 0.214336 -0.283641 -0.008049 -0.000343 0.076602 0.022958 -0.103582
polarizability: 1.82293835e+02 2.31702621e+01 1.63126566e+02 1.53533455e+01 -4.47697163e+00 8.27977331e+01
1716.lowfreq: -7.3585 -4.4909 -0.0008 0.0021 0.0023 5.1175 17.2560 24.6653 30.7657
frequency: 16.8359 24.6495 30.6295 60.0085 84.8310 112.0489 119.9880 129.9520 165.4092 179.2232 234.5938 276.9301 301.0087 329.5318 343.8445 367.0392 391.5491 427.7718 441.7405 501.5133 529.0672 548.3985 594.6297 614.5603 672.0475 700.4299 757.4177 780.7319 812.5924 859.0806 870.8341 886.8342 936.2206 947.7483 994.0872 1013.9173 1029.0811 1033.9486 1083.7672 1091.3554 1108.4380 1150.4351 1168.0196 1207.2640 1226.7487 1247.0019 1258.0491 1277.5464 1302.6684 1350.2502 1358.3766 1361.7889 1381.0900 1387.1417 1426.2162 1438.2800 1454.3241 1461.2537 1465.1430 1569.2668 1592.5538 2969.2400 2972.1580 3003.3002 3033.4893 3037.2224 3055.2380 3080.3661 3141.7747 3158.0735 3176.2504 3182.5240
redmass: 8.6427 5.4889 7.1583 4.6050 11.3895 5.2195 4.4135 5.7865 5.9745 13.8745 4.5895 3.5540 3.7350 7.0516 2.4110 6.7214 6.7742 3.0402 3.2586 2.7486 3.6220 3.9037 5.0853 6.7203 6.1078 4.0581 3.3853 5.0765 1.4136 1.3811 2.2539 2.7575 1.3291 1.9719 2.3527 2.8271 2.5377 3.4287 2.5193 3.1576 2.8054 1.3237 1.2490 1.1374 2.5631 1.1535 1.3239 1.2365 1.1677 1.3046 3.2919 1.4012 1.3305 4.9939 1.0990 1.0812 1.1165 1.1005 2.3779 7.9144 7.2293 1.0567 1.0587 1.0630 1.1029 1.0968 1.0646 1.1046 1.1097 1.0887 1.0965 1.0936
irintensity: 1.1396 1.0885 0.0791 2.2543 4.0645 2.8288 7.1095 0.8750 0.1064 2.9355 1.1372 6.3606 1.1834 6.9209 4.8991 1.0862 3.0396 7.6406 7.1554 12.1794 1.1606 9.5867 26.1533 32.6032 21.5987 1.2162 55.1518 16.2950 54.6645 23.5838 4.4696 30.0210 2.5408 16.6077 15.8669 15.7986 30.2052 106.8937 44.8047 68.7702 21.4155 0.7179 2.5219 10.6003 138.2525 7.4954 31.3787 54.0183 30.3988 15.9091 19.2413 5.7562 10.5936 3.0449 10.9968 15.5713 25.6530 12.2837 235.8580 24.2879 10.4975 32.9643 34.5378 21.4531 46.7407 5.1529 29.2804 17.8958 10.7755 6.9353 3.9469 0.1827
temp: 298.150 k
press: 1.00000 atm
elementType: 17 17 17 8 8 6 6 6 6 6 6 6 6 6 6 1 1 1 1 1 1 1 1 1 1 1
symmnumber: 1
zpe: 498228.7 jmol-1
zpe.correction: 0.189765 hartree
zpe.thermalcorrener: 0.205598 hartree
zpe.thermalcorrenthalpy: 0.206542 hartree
zpe.thermalcorrgfe: 0.142348 hartree
zpe.sumelectzpe: -1917.119962 hartree
zpe.sumelectthermal: -1917.104129 hartree
zpe.sumelectthermalent: -1917.103185 hartree
zpe.sumelectthermalfe: -1917.167379 hartree
dipole: 3.4155 -1.9988 0.5020
dipole: 3.9891
quadrupole: -120.8710 -107.3036 -106.2225
quadrupole: -7.1872 -0.4273 3.5814
quadrupole: -9.4053 4.1621 5.2432 -7.1872 -0.4273 3.5814
hfenergy: -1917.3097273 hartree
pointgroup: C01 [X(C10H11Cl3O2)]
dipole: 1.2229152 -0.3197916 0.9302271 debye
dipolederiv: -0.0798871 0.0058609 -0.0365632 -0.0135592 -0.2835143 0.3167438 -0.0191819 0.3347196 -0.5269424 -0.4596864 -0.1400642 -0.0180436 -0.1898016 -0.3429977 0.023695 0.0448626 0.0708255 -0.1997078 -0.5568304 -0.3726503 0.0797834 -0.3913184 -0.394271 0.1029158 0.0730474 0.0986662 -0.1406745 -1.4797702 -0.6116723 -0.1387007 -0.7725537 -0.7020373 -0.1431359 -0.0787519 -0.025113 -0.264419 -0.8015017 0.1819526 -0.1781624 0.4853553 -0.8329526 0.0901887 -0.1128004 0.083266 -0.4295185 0.1415726 0.0406659 0.0264605 -0.1498388 0.5887224 -0.0737167 0.1191228 -0.2101331 0.3288554 0.8763054 0.2932563 0.177604 0.2514753 0.3420889 0.1126932 0.4333212 0.2641609 0.3682853 1.0496395 0.563761 0.0210994 0.8371961 0.4996752 0.208808 -0.341369 -0.0419175 -0.1947694 0.5936304 -0.3081271 0.0824655 -0.5496924 0.4208755 -0.0339342 0.0263521 0.0929958 0.2696812 -0.1048006 -0.0660091 0.1010458 -0.053928 0.2466248 -0.5212752 -0.0005938 -0.6030396 0.7563154 -0.1966162 0.0250087 -0.0764559 -0.1422043 -0.1496595 -0.1615602 0.2185666 0.0399733 -0.059377 0.3362653 0.2995987 -0.1000969 0.349344 0.3988405 -0.0678867 -0.1328817 -0.0818588 0.1536843 -0.1704957 -0.0893388 0.0233318 -0.1004625 -0.1901429 0.0841154 0.0295837 0.1009519 -0.163999 -0.1279794 -0.0882913 0.1273234 -0.0199516 -0.1441726 0.0126908 0.0356157 -0.0364813 -0.0037504 0.6646623 0.587169 -0.1200768 0.5928477 0.4308491 -0.1751983 -0.1064891 -0.1665936 0.0550921 -0.0329087 -0.1402296 -0.0551883 -0.0391837 -0.0719298 -0.0190986 -0.1051224 -0.0533687 0.0142376 0.0808352 0.0057195 0.0623449 0.0679421 -0.0088951 -0.0463518 0.0709666 0.0208743 -0.1035164 -0.0304737 -0.067661 -0.0427288 -0.0720213 -0.1198658 0.0130752 -0.0515345 0.0563364 0.0765212 -0.0325961 -0.0027754 0.0651147 -0.043546 0.1007498 0.0374971 -0.0115832 -0.0783758 -0.0954096 -0.0001606 0.0719653 0.0167716 0.0591446 0.0557737 0.0474488 0.0499814 -0.0661004 -0.1343662 -0.0286727 -0.0873518 0.0119655 0.0179923 -0.0940406 0.0451152 -0.0275682 0.0524387 0.091846 0.1914583 -0.0342253 -0.0355617 -0.023746 0.1042267 0.0349423 -0.0795653 0.0272423 0.0726874 0.0420055 -0.0581495 0.0744486 -0.0872781 0.0341688 -0.0213714 0.0300495 -0.0009925 -0.0692293 -0.0534206 0.0432091 0.0080082 0.0509043 -0.1052291 0.0249631 0.0097157 0.0096072 0.097192 0.06463 -0.0286368 -0.0619496 -0.0281937 0.1401825 0.0162255 -0.0613258 0.0214814 0.0786959 0.1147954 -0.0229847 -0.0142395 -0.0349226 0.0769304 0.0924113 -0.0124181 0.0904351 0.0225858 unknown
polarizability: 171.4242775|41.3022627|134.2435336|13.5533137|-32.2235407|122.5503229 unknown
InChI: InChI=1S/C10H11Cl3O2/c11-3-4-14-5-6-15-10-2-1-8(12)7-9(10)13/h1-2,7H,3-6H2
charge 0 multiplicity 1
26 atoms
Cl -2.033084 1.850847 -3.130148
Cl 5.556946 0.755301 0.693074
Cl -4.455417 -2.023269 0.028794
O  0.059814 1.844031 -1.033627
O  2.14208 0.340999 0.77685
C  2.309459 1.610279 0.048204
C  0.969991 2.341018 0.018264
C  -0.945039 0.928045 -0.717457
C  3.120205 -0.701627 0.475046
C  -2.020394 0.816579 -1.639878
C  -0.9573 0.102562 0.435197
C  4.400904 -0.617095 1.303575
C  -3.086327 -0.076112 -1.427761
C  -2.024167 -0.792323 0.669592
C  -3.07419 -0.867923 -0.262619
H  3.06129 2.243556 0.560455
H  2.659196 1.422369 -0.987245
H  1.147047 3.394375 -0.26135
H  0.480805 2.309992 1.010395
H  3.354991 -0.726049 -0.609101
H  2.611739 -1.648895 0.741637
H  -0.101981 0.12198 1.116227
H  4.186719 -0.377066 2.355372
H  4.99093 -1.544087 1.223508
H  -3.903993 -0.141189 -2.149614
H  -2.024624 -1.427494 1.559614
