program: Gaussian 09
title: 000234282
version: EM64L-G09RevD.01
frameworkgroup: C1[X(C7H8N2O4S)]
method: RPBEPBE
basis: SDD
operation: Freq
keyword: #p
keyword: freq=noraman
keyword: PBEPBE/SDD
title: #p freq=noraman PBEPBE/SDD
converged: YES YES NO NO
title: Mulliken charges:
elementType: S O O O O N N C C C C C C C H H H H H H H H
charge: 0.942105 -0.519671 -0.525340 -0.199429 -0.189742 -0.713999 0.025246 -0.185244 0.511082 -0.395670 -0.356431 0.410652 -0.362318 -0.805972 0.351121 0.255971 0.293903 0.276807 0.286037 0.226613 0.331742 0.342538
chargesum: 0.00000
title: Mulliken charges with hydrogens summed into heavy atoms:
elementType: S O O O O N N C C C C C C C
charge: 0.942105 -0.519671 -0.525340 -0.199429 -0.189742 -0.039719 0.025246 -0.185244 0.511082 -0.044549 -0.100460 0.410652 -0.068416 -0.016516
polarizability: 1.82244412e+02 6.91544699e+00 1.42891194e+02 4.42195113e-01 -8.59874816e-01 7.44865098e+01
1716.lowfreq: -7.9703 -2.7644 -0.0016 -0.0007 -0.0003 7.1119 50.2868 54.5070 108.2494
frequency: 50.2632 54.5058 108.2473 117.6767 123.7335 150.4508 177.8077 195.6525 242.2905 244.8023 249.3230 285.4247 306.5199 333.1489 349.1714 386.1926 438.7865 449.4969 487.5810 525.7530 534.8121 615.2625 663.4638 692.6447 716.3011 753.8732 804.8862 815.6069 838.5661 851.4430 915.7347 963.0274 996.0439 999.4316 1011.2036 1055.6644 1069.0173 1098.3007 1142.8016 1203.7675 1220.5914 1260.7960 1354.9458 1388.8870 1406.3500 1408.2468 1455.4854 1458.9484 1479.3979 1538.0695 1579.2143 1603.4902 2989.6128 3071.3499 3107.9306 3152.4010 3158.5078 3185.1090 3354.4745 3517.5260
redmass: 8.3439 10.7570 3.6311 4.5359 8.1284 1.1266 2.1853 5.9576 4.3784 10.0927 2.3187 2.9990 4.4262 6.2865 7.1651 6.2529 6.2055 3.3909 4.3628 5.7164 5.3736 7.2081 7.3449 6.4227 3.3479 7.2063 11.7068 1.6842 4.4959 1.3233 4.3911 1.3787 1.3611 1.5890 2.5167 1.5542 1.4741 2.9789 1.2434 3.6767 5.9494 1.4450 4.3423 6.7754 3.9586 1.3992 1.0757 2.6139 1.1227 1.0872 7.2229 7.3634 1.0374 1.0961 1.1006 1.0904 1.0921 1.0955 1.0418 1.0995
irintensity: 2.2447 0.9799 3.6429 1.0019 2.7449 2.1543 20.1369 4.1424 0.6719 7.8028 11.0511 4.5783 8.4541 5.4270 3.1463 22.3867 42.3474 26.1652 145.7034 3.9505 20.3176 5.0442 5.8971 3.7812 14.3641 16.1278 88.0594 45.8869 54.3136 22.3368 77.2265 18.8718 2.5396 2.4371 7.1460 13.1591 33.5049 21.9285 16.2651 191.3767 146.5709 1.1417 34.7482 65.8299 19.8171 31.6295 21.3272 11.3661 40.8102 28.5217 0.1160 37.1944 6.8635 1.4820 16.4597 4.8719 26.0587 2.7434 29.7179 25.2542
temp: 298.150 k
press: 1.00000 atm
elementType: 16 8 8 8 8 7 7 6 6 6 6 6 6 6 1 1 1 1 1 1 1 1
symmnumber: 1
zpe: 393033.2 jmol-1
zpe.correction: 0.149698 hartree
zpe.thermalcorrener: 0.163969 hartree
zpe.thermalcorrenthalpy: 0.164913 hartree
zpe.thermalcorrgfe: 0.108441 hartree
zpe.sumelectzpe: -1078.702482 hartree
zpe.sumelectthermal: -1078.688211 hartree
zpe.sumelectthermalent: -1078.687267 hartree
zpe.sumelectthermalfe: -1078.743739 hartree
dipole: 2.7326 4.9175 3.1443
dipole: 6.4448
quadrupole: -103.2867 -89.1312 -89.1032
quadrupole: -5.4329 11.2854 -4.7601
quadrupole: -9.4463 4.7092 4.7371 -5.4329 11.2854 -4.7601
hfenergy: -1078.8521799 hartree
pointgroup: C01[X(C7H8N2O4S1)]
dipole: 1.1311393 1.8076685 1.37189 debye
dipolederiv: 1.7168447 -0.2515006 0.186706 -0.3921277 1.3874715 -0.0613303 0.1660184 -0.0454662 1.506091 -0.6364396 0.0348506 -0.0875166 0.0660942 -0.7087076 -0.1066136 -0.0123527 0.0363194 -0.5029876 -0.7144787 0.0485839 0.0978304 0.0809367 -0.5503038 0.0971277 0.0273392 0.0214933 -0.5525416 -0.9287176 0.1280532 -0.0182926 0.0752964 -0.492925 -0.0113869 -0.0119388 -0.0116129 -0.2235825 -0.5672926 -0.1167019 -0.0193247 -0.1546887 -0.7643063 -0.0360987 -0.0171696 -0.0293511 -0.214835 -0.6077512 0.0891682 -0.1703568 0.100395 -0.5038841 -0.0346892 -0.2328366 -0.0719844 -0.7781375 1.7184393 0.2205528 0.0628242 0.3741931 1.1394406 0.0630975 0.0614023 0.0548131 0.1947879 -0.0678072 -0.2065887 0.0133461 -0.3090915 -0.2237341 -0.0070536 0.0567058 -0.0263884 -0.1991374 0.3250082 0.4263361 0.0297113 0.1075045 0.128386 0.0118789 0.0198804 0.0126742 0.0522995 0.0834097 0.0791134 0.0112451 0.1430743 -0.2240395 0.0013754 0.0179197 -0.0012161 -0.0524797 -0.4393511 -0.180486 -0.0198892 0.1042301 0.1201763 0.0219705 -0.0144189 0.0179046 -0.1325209 -0.5208225 -0.1689542 -0.0307177 -0.3706936 -0.1371412 -0.0229052 -0.0517128 -0.008622 0.0539524 0.120365 -0.0126493 0.0011667 0.2881383 0.1014352 0.0227466 0.0259469 0.0066084 -0.0729266 -0.3691282 -0.1652893 -0.0235972 -0.0322326 0.054964 0.0185329 0.0085247 0.0066737 -0.0396564 0.2181666 -0.0091849 0.0080587 -0.0157832 0.1461418 -0.0058238 0.0055211 -0.004311 0.1679836 0.0495476 -0.0148809 -0.0044987 0.0001405 -0.0723808 -0.013816 -0.0020604 -0.015881 0.1497393 0.0691149 0.0569815 0.0014583 0.0233493 0.119241 -0.0032553 0.0029514 -0.001718 0.1672158 0.0705582 -0.0110703 -0.0475062 -0.0362576 0.0946216 0.0594936 -0.0638039 0.0301211 0.0204684 0.0892204 -0.0229494 0.0489706 -0.040116 0.1211662 -0.0693605 0.0472747 -0.0210289 0.0343771 0.0787576 0.1042681 0.0027626 -0.0124763 -0.1352504 -0.0175539 -0.0087438 -0.0222062 0.1236571 0.1644484 -0.0644874 -0.0917056 -0.0754501 0.1422153 0.0542817 -0.0199013 0.0412173 0.1846447 0.147908 0.0368352 0.0493254 0.0755649 0.2574133 0.0393823 -0.0045462 0.0319611 0.1135885 unknown
polarizability: 182.6897969|4.4877263|142.1542338|4.8995756|2.5724221|74.7780854 unknown
InChI: InChI=1S/C7H8N2O4S/c1-5-2-3-6(9(10)11)4-7(5)14(8,12)13/h2-4H,8H2,1H3
charge 0 multiplicity 1
22 atoms
S  2.236525 -1.038954 -0.114833
O  1.716244 -2.572017 -0.274517
O  3.331275 -0.406452 -1.1360
O  -4.08638 0.127755 -0.132416
O  -3.006251 -1.882116 -0.212252
N  2.961221 -0.771611 1.563179
N  -3.016585 -0.594692 -0.145062
C  0.681213 0.053453 -0.024731
C  0.790054 1.464075 0.070502
C  -0.524418 -0.652741 -0.100889
C  -0.443188 2.173196 0.088701
C  -1.710194 0.108131 -0.07485
C  -1.685865 1.515356 0.018043
C  2.109162 2.194965 0.159018
H  -0.547742 -1.744333 -0.186315
H  -0.414484 3.265211 0.161478
H  -2.629844 2.066426 0.032466
H  2.682129 1.843765 1.037115
H  2.735563 1.98896 -0.726997
H  1.951232 3.281469 0.246148
H  2.603005 -1.498585 2.206396
H  3.99023 -0.806962 1.457216
