program: Gaussian 09
title: 000234267
version: EM64L-G09RevD.01
frameworkgroup: C1[X(C12H15BrO)]
method: RPBEPBE
basis: SDD
operation: Freq
keyword: #p
keyword: freq=noraman
keyword: PBEPBE/SDD
title: #p freq=noraman PBEPBE/SDD
converged: YES YES NO NO
title: Mulliken charges:
elementType: Br O C C C C C C C C C C C C H H H H H H H H H H H H H H H
charge: 0.020435 -0.402345 -0.160007 -0.442555 -0.446171 -0.396605 -0.413805 -0.389579 0.368052 0.236246 -0.377395 -0.410742 -0.273468 -0.202806 0.170148 0.223810 0.215619 0.185951 0.218041 0.189180 0.209149 0.205736 0.193921 0.195282 0.204454 0.239079 0.230475 0.249007 0.360892
chargesum: 0.00000
title: Mulliken charges with hydrogens summed into heavy atoms:
elementType: Br O C C C C C C C C C C C C
charge: 0.020435 -0.041452 0.010141 -0.003126 -0.042179 0.001724 -0.014147 0.010157 0.368052 0.236246 -0.138316 -0.410742 -0.042993 0.046201
polarizability: 1.99441967e+02 5.40825538e+00 1.47767394e+02 -3.68013253e+00 7.01830227e+00 8.81813498e+01
1716.lowfreq: -14.7231 -9.2440 -0.0005 -0.0005 -0.0001 4.5529 39.9834 62.1446 87.3211
frequency: 39.8640 61.8066 87.3075 134.6215 168.4965 213.4956 231.7930 234.1382 251.0540 303.7070 326.8361 335.1781 346.4426 424.6578 432.4160 483.6514 524.7449 536.4256 541.6005 560.7407 657.7180 741.0083 763.7658 782.7478 786.8088 801.0682 833.0378 863.1209 883.6282 900.5553 906.7849 923.2163 963.8987 992.2440 1047.2216 1052.8640 1060.0570 1080.3170 1088.7218 1112.3913 1131.9362 1154.2491 1179.6444 1188.5895 1227.6810 1247.2552 1255.8296 1262.5853 1276.0262 1282.1340 1306.4304 1317.7203 1336.5192 1341.9756 1345.3765 1356.2879 1384.9734 1444.6249 1450.1115 1460.4766 1463.7011 1466.7189 1472.3608 1480.5925 1566.8050 1613.8378 2868.7732 2962.5011 2965.1799 2969.7006 2970.5229 2975.9451 3026.6133 3031.0820 3033.1456 3036.9834 3045.7255 3142.4644 3161.1383 3175.5121 3570.6049
redmass: 3.9769 4.2925 4.3863 5.1007 4.5826 3.1853 4.1596 2.7058 3.3526 6.6566 4.1425 1.8637 1.1704 2.5469 3.0447 1.8618 4.0927 3.8467 3.5845 5.7150 4.7789 2.9704 1.8731 2.0142 1.4693 5.7482 3.3633 1.6317 1.7378 1.6652 1.6460 1.9328 1.3320 2.3958 1.8046 1.6584 1.3901 1.7560 2.0211 2.4892 1.8758 1.5708 1.2826 1.8402 1.4547 1.8531 1.3340 1.3709 1.6127 1.2904 1.2849 1.3626 1.3669 1.5027 1.5383 1.5915 3.2915 3.2706 2.5218 1.1098 1.0861 1.0963 1.0865 1.0975 6.2862 7.1778 1.0802 1.0644 1.0647 1.0619 1.0612 1.0613 1.0970 1.0950 1.1008 1.1018 1.1035 1.0860 1.0919 1.0989 1.0651
irintensity: 0.1376 0.1591 0.0737 1.8384 0.8326 0.7743 0.6804 0.9732 3.0688 2.2959 0.8166 5.6486 104.2455 5.4584 0.9223 0.1610 9.9430 1.3858 1.9477 2.6348 16.1024 28.7569 31.0939 15.1297 0.4752 18.0266 4.4438 19.9191 10.8101 7.2329 1.8097 0.3122 0.3989 4.2982 0.3307 5.7007 6.5249 38.1877 87.6209 0.0539 33.2057 41.7194 0.1520 22.3408 3.7787 15.1617 2.0111 26.1427 4.7664 4.2196 3.4607 0.2805 0.3571 5.3026 5.7240 10.9352 22.7359 61.1825 10.2754 1.1370 9.3690 6.3654 20.3172 5.6560 15.3326 2.7108 30.7935 33.3554 39.0893 28.4281 24.1787 24.0731 70.8149 75.6273 9.5287 4.3147 111.3069 3.8480 10.3925 13.6828 31.7649
temp: 298.150 k
press: 1.00000 atm
elementType: 35 8 6 6 6 6 6 6 6 6 6 6 6 6 1 1 1 1 1 1 1 1 1 1 1 1 1 1 1
symmnumber: 1
zpe: 630614.4 jmol-1
zpe.correction: 0.240188 hartree
zpe.thermalcorrener: 0.253331 hartree
zpe.thermalcorrenthalpy: 0.254275 hartree
zpe.thermalcorrgfe: 0.199573 hartree
zpe.sumelectzpe: -553.908487 hartree
zpe.sumelectthermal: -553.895344 hartree
zpe.sumelectthermalent: -553.894400 hartree
zpe.sumelectthermalfe: -553.949102 hartree
dipole: 4.2708 1.1001 0.0470
dipole: 4.4104
quadrupole: -91.2786 -88.5210 -95.5417
quadrupole: -5.0040 -1.6270 2.1178
quadrupole: 0.5018 3.2595 -3.7613 -5.0040 -1.6270 2.1178
hfenergy: -554.148675 hartree
pointgroup: C01 [X(C12H15Br1O1)]
dipole: 1.5828337 -0.7091354 0.0513533 debye
polarizability: 196.0152746|-13.3338919|151.5986847|7.1444839|1.6985052|87.7767514 unknown
InChI: InChI=1S/C12H15BrO/c13-11-8-4-7-10(12(11)14)9-5-2-1-3-6-9/h4,7-9,14H,1-3,5-6H2
charge 0 multiplicity 1
29 atoms
Br -4.102761 1.664167 -0.11839
O  -1.096363 2.00708 0.296397
C  1.110785 0.077432 0.287789
C  1.681103 0.710461 -1.023224
C  2.057434 -1.051181 0.770205
C  3.118087 1.244436 -0.816749
C  3.490327 -0.514181 0.998467
C  4.060312 0.139991 -0.283151
C  -0.347116 -0.350209 0.103411
C  -1.371306 0.647319 0.096825
C  -0.730516 -1.695766 -0.106608
C  -2.720493 0.281851 -0.11926
C  -2.078586 -2.054907 -0.324766
C  -3.082546 -1.06166 -0.333743
H  1.1588 0.860284 1.085161
H  1.017808 1.516799 -1.393295
H  1.682636 -0.073183 -1.807365
H  2.098091 -1.851722 0.003638
H  1.661578 -1.50792 1.697626
H  3.098147 2.088028 -0.094688
H  3.506952 1.651846 -1.769708
H  4.150258 -1.337447 1.333348
H  3.475124 0.235361 1.817143
H  4.187165 -0.638432 -1.063675
H  5.065325 0.558783 -0.083264
H  0.034559 -2.477764 -0.096113
H  -2.352911 -3.102181 -0.485934
H  -4.13152 -1.322251 -0.500981
H  -0.137175 2.143268 0.499202
