program: Gaussian 09
title: 000234234
version: EM64L-G09RevD.01
frameworkgroup: C1[X(C11H12Cl2N2O2)]
method: RPBEPBE
basis: SDD
operation: Freq
keyword: #p
keyword: freq=noraman
keyword: PBEPBE/SDD
title: #p freq=noraman PBEPBE/SDD
converged: YES YES NO NO
title: Mulliken charges:
elementType: Cl Cl O O N N C C C C C C C C C C C H H H H H H H H H H H H
charge: -0.072108 -0.052452 -0.242953 -0.308752 -0.193013 -0.496631 -0.374058 -0.349544 -0.287464 -0.301442 0.300175 0.637141 -0.398606 -0.253446 -0.103208 -0.201483 -0.262673 0.238747 0.202084 0.268102 0.227133 0.196335 0.226646 0.225867 0.203984 0.308563 0.341682 0.258656 0.262718
chargesum: 0.00000
title: Mulliken charges with hydrogens summed into heavy atoms:
elementType: Cl Cl O O N N C C C C C C C C C C C
charge: -0.072108 -0.052452 -0.242953 -0.308752 -0.193013 -0.188068 0.066773 0.145691 0.135517 0.128408 0.300175 0.637141 -0.398606 0.088237 -0.103208 0.057173 0.000045
polarizability: 2.33285131e+02 -1.10055353e+01 1.78864017e+02 8.60326756e+00 1.47175514e+00 8.09365220e+01
1716.lowfreq: -2.6415 -0.0025 -0.0024 -0.0020 0.8437 9.3109 22.7633 36.5520 63.2344
frequency: 21.8814 36.2939 63.1686 79.4978 89.0076 103.5211 152.2184 183.0842 211.5429 239.5043 261.4384 287.7300 303.1445 309.2402 343.0546 386.6970 418.3780 425.7986 441.3921 460.1328 506.0024 556.9015 565.2632 591.8734 613.0429 636.1310 695.9631 703.6480 710.2173 789.4453 796.6876 829.7358 833.5343 888.2237 916.5279 917.3645 930.3643 976.4831 1006.3020 1010.2072 1050.9224 1066.8491 1074.6567 1077.1151 1111.7021 1133.6023 1183.8525 1197.2426 1228.9743 1236.9904 1259.5459 1272.3034 1279.9300 1334.4667 1343.3148 1358.4546 1362.7513 1373.2904 1395.0276 1413.1370 1446.5585 1447.1573 1449.9913 1454.2557 1458.1149 1510.2229 1570.2206 1603.1159 1620.2763 2950.6781 2963.2008 2971.7095 2979.7419 3066.6603 3083.3036 3088.6849 3093.3997 3167.0221 3187.4358 3189.2570 3509.2545
redmass: 6.0880 3.6248 6.5940 5.6716 8.5635 7.7669 9.5567 4.5598 3.5804 3.2640 4.2552 4.9957 6.1061 20.8378 5.2190 1.9257 5.9206 5.0946 3.1690 3.0760 8.3142 2.9355 2.5687 4.9919 1.6338 2.9690 9.3334 6.1685 4.8514 1.3242 4.6458 4.7508 1.6936 5.9414 1.7862 1.7719 1.3504 3.4242 5.7171 2.4651 2.1256 2.7587 3.5885 1.8390 2.2292 1.3817 2.9721 1.0980 1.7526 1.6220 1.4911 1.4608 1.3375 1.2397 1.2348 2.1947 1.5927 1.4887 2.5912 3.8942 1.2244 1.1851 1.9688 1.1032 1.0987 2.7556 5.1814 7.2248 4.5984 1.0682 1.0683 1.0641 1.0656 1.0963 1.0970 1.0946 1.0991 1.0891 1.0969 1.0939 1.0750
irintensity: 0.0360 1.4689 0.7932 4.0865 0.2183 3.4376 0.3144 5.8609 0.1624 0.3667 10.6992 6.0970 6.2878 0.9055 12.0407 3.6187 6.8407 1.8938 18.5323 0.2237 25.4584 45.6592 2.0099 4.1601 47.6465 0.7915 15.8303 9.9306 19.2958 46.3475 4.7638 22.0000 1.1021 38.9628 16.2453 23.8397 11.3516 21.9637 85.7917 14.6593 32.1404 16.6547 38.6881 24.1999 15.5575 4.5043 15.1698 19.4638 301.3029 24.4505 106.8690 3.4420 45.4963 4.8577 7.0057 34.7332 9.9797 30.8492 208.0253 127.4676 0.5097 15.6783 24.5329 22.9499 9.3917 636.9743 64.7523 70.5185 408.6673 46.9533 42.8792 32.5920 80.5649 32.5200 33.2605 10.8291 33.3531 0.4753 0.6679 28.4944 33.3155
temp: 298.150 k
press: 1.00000 atm
elementType: 17 17 8 8 7 7 6 6 6 6 6 6 6 6 6 6 6 1 1 1 1 1 1 1 1 1 1 1 1
symmnumber: 1
zpe: 573340.4 jmol-1
zpe.correction: 0.218374 hartree
zpe.thermalcorrener: 0.234190 hartree
zpe.thermalcorrenthalpy: 0.235135 hartree
zpe.thermalcorrgfe: 0.172975 hartree
zpe.sumelectzpe: -1605.183832 hartree
zpe.sumelectthermal: -1605.168016 hartree
zpe.sumelectthermalent: -1605.167072 hartree
zpe.sumelectthermalfe: -1605.229231 hartree
dipole: -1.7538 3.1787 0.2039
dipole: 3.6362
quadrupole: -114.4346 -115.0922 -114.5825
quadrupole: 7.2480 1.9700 0.1593
quadrupole: 0.2685 -0.3891 0.1206 7.2480 1.9700 0.1593
hfenergy: -1605.4022061 hartree
pointgroup: C01 [X(C11H12Cl2N2O2)]
dipole: -0.5752037 -1.3040301 -0.1232178 debye
polarizability: 230.9904049|15.8931502|181.1120724|-7.3662407|3.8394544|80.9831926 unknown
InChI: InChI=1S/C11H12Cl2N2O2/c12-8-1-2-9(13)10(7-8)14-11(16)15-3-5-17-6-4-15/h1-2,7,14H,3-6H2
charge 0 multiplicity 1
29 atoms
Cl 1.48894 -3.062566 0.008634
Cl 4.299521 2.710712 -0.19357
O  -4.942942 -0.286012 -0.553304
O  -0.60809 1.830908 0.427694
N  -2.228046 0.153848 0.312763
N  0.070143 -0.414433 0.207836
C  -2.718735 -1.220975 0.078343
C  -3.295156 1.125486 0.64852
C  -3.86866 -1.198609 -0.957745
C  -4.407243 1.083441 -0.411226
C  -0.902402 0.599327 0.319918
C  1.461545 -0.245776 0.065438
C  2.283897 -1.404163 -0.045913
C  2.106894 1.022496 0.020361
C  3.500749 1.073406 -0.136328
C  3.675843 -1.335809 -0.197101
C  4.310367 -0.0735 -0.246213
H  -3.08909 -1.65632 1.029253
H  -1.924396 -1.876196 -0.319127
H  -2.834422 2.125167 0.705062
H  -3.721557 0.867698 1.639481
H  -3.466214 -0.895883 -1.949107
H  -4.33603 -2.194022 -1.036606
H  -5.265738 1.704317 -0.109006
H  -4.016364 1.435595 -1.389496
H  -0.227513 -1.3908 0.267982
H  1.497259 1.922301 0.117803
H  4.263806 -2.25396 -0.278127
H  5.393636 0.004421 -0.364218
