program: Gaussian 09
title: 000234232
version: EM64L-G09RevD.01
frameworkgroup: C1[X(C10H19N3O)]
method: RPBEPBE
basis: SDD
operation: Freq
keyword: #p
keyword: freq=noraman
keyword: PBEPBE/SDD
title: #p freq=noraman PBEPBE/SDD
converged: YES YES NO NO
title: Mulliken charges:
elementType: O N N N C C C C C C C C C C H H H H H H H H H H H H H H H H H H H
charge: -0.252639 0.042782 -0.409983 -0.654247 0.023574 -0.429815 -0.431116 -0.406104 -0.403416 -0.383765 -0.553813 0.149324 -0.821188 0.294847 0.185779 0.195983 0.191941 0.216289 0.197251 0.197814 0.189255 0.184479 0.200323 0.197482 0.191379 0.201436 0.242209 0.231409 0.234872 0.254555 0.283817 0.342542 0.296742
chargesum: 0.00000
title: Mulliken charges with hydrogens summed into heavy atoms:
elementType: O N N N C C C C C C C C C C
charge: -0.252639 0.042782 -0.126167 -0.014962 0.209354 -0.041891 -0.017576 -0.019035 -0.018614 0.005096 -0.110168 0.149324 -0.100352 0.294847
polarizability: 1.83209269e+02 -1.49306321e+01 1.20000568e+02 6.63038196e+00 8.24868223e+00 1.09519962e+02
1716.lowfreq: -18.1437 -9.8012 -0.0009 -0.0006 0.0005 9.1936 16.9373 27.6979 37.4515
frequency: 16.3351 27.4828 37.3415 72.2400 112.7769 117.7800 147.5834 180.7691 211.7256 236.0413 252.0621 279.3777 310.3016 313.8593 357.1060 415.0032 426.9697 436.6278 453.1234 481.2737 498.2305 541.2729 570.4605 590.5728 633.8499 711.5452 771.9614 780.6029 812.1971 841.3739 843.8805 887.6546 905.7261 928.1647 939.4268 958.5233 986.4811 1011.8273 1039.7583 1048.1023 1052.5371 1066.7282 1080.4902 1092.2159 1112.5495 1144.7353 1172.3009 1200.1028 1246.5673 1254.6538 1260.0338 1270.7348 1281.8261 1295.0691 1309.2810 1319.8641 1331.5481 1336.7395 1339.3278 1342.6337 1357.3819 1381.9206 1443.5994 1454.4279 1459.2509 1461.3079 1462.0098 1467.6636 1475.0273 1476.5987 1507.5143 1600.1162 1604.8649 1682.4638 2928.5862 2950.1241 2953.3692 2956.2493 2959.7692 2960.8620 2966.3849 2967.4179 3013.2232 3020.1296 3023.9837 3025.8921 3030.4055 3039.6077 3051.1494 3097.8112 3416.4194 3537.6189 3696.9791
redmass: 4.5903 3.5959 3.1888 2.9891 3.6252 3.3657 1.4326 2.1236 1.9258 2.5384 1.4504 3.9665 3.2045 1.9808 2.2653 2.2204 2.9435 2.1963 1.7521 1.5776 1.5262 1.7392 2.2891 3.6339 4.0407 8.4128 2.2374 1.5825 2.8415 2.3273 1.7790 1.5600 1.5765 2.3155 2.2088 2.3002 1.7045 1.5634 2.4850 1.8727 1.1066 2.2809 1.6534 2.2251 2.6046 2.6602 1.4318 1.4789 1.2563 1.2913 1.4109 1.5430 1.8085 2.3245 1.2863 1.4364 1.3768 1.5437 1.5559 1.4935 1.4969 1.2247 1.1142 1.1518 1.1027 1.0910 1.0899 1.0812 1.0964 1.0470 1.5186 1.6109 3.0126 5.5123 1.0811 1.0417 1.0606 1.0620 1.0636 1.0635 1.0628 1.0632 1.0988 1.0974 1.0984 1.0960 1.1004 1.1033 1.0957 1.0947 1.0746 1.0459 1.1034
irintensity: 15.0628 4.4234 0.8805 1.5520 1.5904 5.4200 1.7360 0.6945 0.0895 1.7306 13.3388 0.8479 14.5109 3.3243 4.1229 0.0437 23.3641 8.5247 181.3003 106.6662 2.6868 35.5921 40.7284 13.3642 12.6628 16.8851 0.1987 0.0076 4.0159 2.4169 3.8917 6.8915 3.2351 0.6541 1.6617 9.6792 6.1682 1.6922 35.2686 0.6472 0.0672 9.8935 3.5177 52.3288 1.1055 88.8447 4.7672 21.1949 1.0892 0.4729 3.3506 40.5821 24.7231 328.1531 8.4412 1.2443 0.1988 0.9988 0.2906 0.8692 1.2839 33.1971 37.3140 88.0893 48.2289 5.3597 16.0539 24.7890 1.5362 14.7313 222.3010 109.4662 23.1403 305.6217 17.7581 14.3093 12.8183 79.8371 22.0647 39.3392 35.8714 23.2630 70.9829 24.7676 77.6194 42.5697 6.1457 110.0534 41.2152 16.7989 16.4870 41.0374 40.7912
temp: 298.150 k
press: 1.00000 atm
elementType: 8 7 7 7 6 6 6 6 6 6 6 6 6 6 1 1 1 1 1 1 1 1 1 1 1 1 1 1 1 1 1 1 1
symmnumber: 1
zpe: 748428.4 jmol-1
zpe.correction: 0.285061 hartree
zpe.thermalcorrener: 0.300664 hartree
zpe.thermalcorrenthalpy: 0.301608 hartree
zpe.thermalcorrgfe: 0.240259 hartree
zpe.sumelectzpe: -630.818646 hartree
zpe.sumelectthermal: -630.803044 hartree
zpe.sumelectthermalent: -630.802100 hartree
zpe.sumelectthermalfe: -630.863448 hartree
dipole: 0.1697 4.0276 4.6431
dipole: 6.1489
quadrupole: -71.9890 -87.1107 -87.3580
quadrupole: 9.6237 17.6564 -0.8306
quadrupole: 10.1636 -4.9581 -5.2054 9.6237 17.6564 -0.8306
hfenergy: -631.1037075 hartree
pointgroup: C01 [X(C10H19N3O1)]
dipole: -0.0038396 1.3633565 1.9984059 debye
polarizability: 183.245049|-15.0902771|117.6140765|6.7219434|8.8763498|111.8706733 unknown
InChI: InChI=1S/C10H19N3O/c1-8(12-13-10(11)14)7-9-5-3-2-4-6-9/h9,13H,2-7,11H2,1H3
charge 0 multiplicity 1
33 atoms
O  3.844099 -1.326423 -1.091161
N  1.656682 0.302408 -0.356803
N  2.835215 0.235898 0.379205
N  5.021751 -0.510722 0.748663
C  -1.821183 0.492694 -0.02533
C  -3.113584 0.7961 -0.82676
C  -1.656704 -1.03561 0.172687
C  -4.363553 0.171513 -0.162415
C  -2.901037 -1.662918 0.845083
C  -4.189025 -1.352358 0.045375
C  -0.581873 1.122878 -0.728204
C  0.689184 1.076177 0.094893
C  0.773154 1.910011 1.367638
C  3.891302 -0.590599 -0.074278
H  -1.935128 0.958064 0.980276
H  -3.001059 0.38741 -1.853266
H  -3.244059 1.892375 -0.932251
H  -0.74676 -1.248186 0.766019
H  -1.496148 -1.506406 -0.819743
H  -5.262197 0.374703 -0.777154
H  -4.533455 0.654955 0.822609
H  -3.005718 -1.258177 1.873905
H  -2.766378 -2.757549 0.944855
H  -5.07392 -1.771372 0.563218
H  -4.130249 -1.850147 -0.944849
H  -0.817509 2.181165 -0.971215
H  -0.394344 0.594883 -1.681266
H  1.625785 2.619708 1.336333
H  0.895682 1.278701 2.272042
H  -0.143926 2.504163 1.50473
H  2.946063 0.762583 1.255229
H  5.812985 -1.091915 0.485001
H  5.11451 0.118191 1.543637
