program: Gaussian 09
title: 000234231
version: EM64L-G09RevD.01
frameworkgroup: C1[X(C10H18O3)]
method: RPBEPBE
basis: SDD
operation: Freq
keyword: #pfreq=noraman
keyword: PBEPBE/SDD
title: #p freq=noraman PBEPBE/SDD
converged: YES YES NO NO
title: Mulliken charges:
elementType: O O O C C C C C C C C C C H H H H H H H H H H H H H H H H H H
charge: -0.312833 -0.267863 -0.244849 0.335376 0.398048 -0.118672 -0.589103 -0.712126 -0.716968 -0.730585 -0.725814 0.290101 -0.764067 0.280039 0.242148 0.236452 0.228474 0.216819 0.220726 0.229393 0.215387 0.221901 0.228575 0.223768 0.206972 0.201146 0.223481 0.234487 0.247371 0.253167 0.249050
chargesum: 0.00000
title: Mulliken charges with hydrogens summed into heavy atoms:
elementType: O O O C C C C C C C C C C
charge: -0.312833 -0.267863 -0.244849 0.335376 0.398048 0.161367 -0.110502 -0.046108 -0.050287 -0.071270 -0.066700 0.290101 -0.014479
polarizability: 1.40313578e+02 4.99602929e+00 1.05125217e+02 9.76744615e-01 9.32458896e-02 1.06487892e+02
1716.lowfreq: -45.0951 -0.0008 -0.0004 0.0006 2.3814 5.2676 10.3950 24.1057 49.7024
frequency: -45.0778 23.8048 49.4578 65.0914 78.9426 174.1665 177.9435 208.5079 210.8489 235.8245 243.2580 258.4058 274.2501 289.9709 308.3233 353.5171 374.8770 387.9155 442.8110 474.1410 508.2712 547.0657 564.5747 576.2924 626.8320 731.5387 751.7443 809.7878 849.1319 888.0095 915.6586 921.4971 934.7880 952.3604 960.7721 988.7771 989.4783 1001.7301 1014.3608 1044.7460 1064.0845 1106.6854 1132.1278 1166.0686 1189.0005 1212.5413 1223.2064 1262.4955 1268.4960 1285.5766 1326.6986 1345.4828 1374.0142 1377.7133 1383.2283 1390.1442 1394.4086 1449.1138 1451.8637 1455.8563 1458.3534 1460.4274 1463.4093 1468.4750 1474.0458 1475.4900 1481.0538 1485.0293 1646.3462 2979.1472 2983.7270 2990.0019 2993.8450 3008.0261 3016.3839 3042.3065 3074.8239 3080.9320 3083.0746 3087.5826 3090.4659 3093.7969 3094.8944 3095.5814 3097.4397 3100.2130 3139.8266
redmass: 1.0627 6.5356 3.2456 3.2813 2.9649 3.0181 1.0687 1.0954 1.3416 1.9620 1.6646 1.5308 3.5100 2.5184 2.3662 2.7646 2.4853 2.6940 2.7910 2.5639 3.4416 3.5266 3.3670 3.4722 4.5907 4.5884 3.2414 3.0679 4.6952 2.9821 1.8482 1.5455 1.6556 2.0365 1.7631 2.0749 1.2795 2.1178 1.5512 1.6292 1.7239 2.0772 2.1560 2.2112 3.7909 2.7810 2.1140 2.4068 2.4284 1.9223 1.4710 1.3705 1.2554 1.2511 1.2258 1.2161 1.2122 1.0506 1.0531 1.0675 1.0471 1.0549 1.0503 1.0620 1.0668 1.0772 1.0538 1.0587 10.5540 1.0356 1.0361 1.0352 1.0356 1.0364 1.0621 1.0855 1.0991 1.0992 1.1028 1.0995 1.1002 1.0996 1.0995 1.0972 1.1000 1.0999 1.1012
irintensity: 1.4303 2.6292 1.3999 0.6620 1.4444 4.1925 0.1723 0.2749 0.7509 1.9714 2.5246 0.2404 3.3014 0.0259 0.1103 3.1246 0.2918 1.1906 6.2992 3.0116 10.5827 8.4296 2.6824 1.8837 2.8979 4.5223 7.0624 4.5294 14.8322 49.2983 17.7704 2.2594 2.2127 10.0501 25.4485 23.1120 1.2620 108.7279 5.9028 9.1200 17.6487 23.2520 81.0534 18.4053 389.6886 22.8267 2.7640 26.9329 10.1454 31.3877 2.3404 6.8409 7.1321 55.2234 51.1348 23.2937 14.0120 0.0113 3.2413 12.3829 17.5244 0.8601 5.5398 2.3761 12.0541 23.3324 7.7774 7.5268 194.8187 21.8057 23.8789 17.8402 14.6354 3.3562 15.0437 8.3894 10.1631 47.9760 6.8129 8.9288 38.1609 41.0056 21.0990 7.0024 42.8163 37.6571 8.8733
temp: 298.150 k
press: 1.00000 atm
elementType: 8 8 8 6 6 6 6 6 6 6 6 6 6 1 1 1 1 1 1 1 1 1 1 1 1 1 1 1 1 1 1
symmnumber: 1
zpe: 691040.7 jmol-1
zpe.correction: 0.263203 hartree
zpe.thermalcorrener: 0.277953 hartree
zpe.thermalcorrenthalpy: 0.278897 hartree
zpe.thermalcorrgfe: 0.221391 hartree
zpe.sumelectzpe: -616.493933 hartree
zpe.sumelectthermal: -616.479183 hartree
zpe.sumelectthermalent: -616.478239 hartree
zpe.sumelectthermalfe: -616.535745 hartree
dipole: 0.3356 -1.2470 -2.2135
dipole: 2.5626
quadrupole: -76.8622 -77.4897 -83.6277
quadrupole: 3.7469 -6.2090 0.1299
quadrupole: 2.4643 1.8368 -4.3011 3.7469 -6.2090 0.1299
hfenergy: -616.7571367 hartree
pointgroup: C01 [X(C10H18O3)]
dipole: -0.3079863 0.4663777 -0.8391253 debye
polarizability: 135.97134|12.2494411|109.1876305|-3.0094709|-1.2304408|106.7677165 unknown
InChI: InChI=1S/C10H18O3/c1-7(11)12-8-6-9(2,3)13-10(8,4)5/h8H,6H2,1-5H3
charge 0 multiplicity 1
31 atoms
O  1.956596 -0.540048 0.186751
O  -1.64297 0.016572 -0.400919
O  -2.692838 -0.350064 1.660471
C  0.584565 -1.111368 0.02439
C  1.953762 0.95034 -0.07942
C  -0.315792 0.142218 0.257391
C  0.467549 1.298998 -0.382618
C  0.432591 -1.702894 -1.392842
C  0.414472 -2.185992 1.107623
C  2.89541 1.22494 -1.265178
C  2.463543 1.623369 1.210713
C  -2.758391 -0.22752 0.416877
C  -4.019483 -0.311651 -0.416141
H  -0.477026 0.290638 1.340408
H  0.273468 1.313604 -1.47004
H  0.179483 2.278815 0.032828
H  1.233292 -2.444887 -1.555727
H  -0.545417 -2.201225 -1.513735
H  0.51713 -0.925388 -2.171514
H  0.606245 -1.760132 2.107143
H  -0.61154 -2.595838 1.093779
H  1.125779 -3.013599 0.940355
H  3.922756 0.90342 -1.019195
H  2.567102 0.668577 -2.160358
H  2.91687 2.304008 -1.508315
H  2.613506 2.708682 1.059327
H  1.75064 1.479594 2.042141
H  3.427205 1.174352 1.507426
H  -4.499526 -1.292578 -0.255108
H  -3.804316 -0.173069 -1.485087
H  -4.732964 0.459126 -0.076327
