program: Gaussian 09
title: 000234227
version: EM64L-G09RevD.01
frameworkgroup: C1[X(C10H14O2)]
method: RPBEPBE
basis: SDD
operation: Freq
keyword: #pfreq=noraman
keyword: PBEPBE/SDD
title: #p freq=noraman PBEPBE/SDD
converged: YES YES NO NO
title: Mulliken charges:
elementType: O O C C C C C C C C C C H H H H H H H H H H H H H H
charge: -0.490192 -0.449086 0.117059 -0.079295 0.407702 -0.754342 -0.736508 -0.401910 -0.400712 -0.244475 -0.219888 -0.242929 0.211359 0.224007 0.240208 0.240618 0.231200 0.228284 0.244023 0.225664 0.288442 0.350014 0.335290 0.224288 0.224317 0.226861
chargesum: 0.00000
title: Mulliken charges with hydrogens summed into heavy atoms:
elementType: O O C C C C C C C C C C
charge: -0.140178 -0.113795 0.117059 0.132064 0.407702 -0.049509 -0.033001 -0.176246 -0.112270 -0.020187 0.004429 -0.016067
polarizability: 1.41020116e+02 9.49206700e+00 8.33686185e+01 -3.06181642e+00 1.03882167e+01 1.05531549e+02
1716.lowfreq: -139.4688 -8.0678 -0.0008 -0.0007 -0.0005 4.0693 17.4146 50.7564 75.8490
frequency: -139.4598 50.6230 75.7764 99.6667 199.4575 216.9024 234.5361 252.0514 270.1540 304.0250 321.2480 353.7322 405.3594 409.8330 439.7715 466.6115 505.1043 564.4075 616.8269 629.1718 701.3065 708.8209 770.1412 817.5924 858.4403 868.5806 897.8003 927.6291 981.1306 989.7510 994.4349 1001.2958 1020.2537 1036.3816 1045.7700 1065.6821 1091.2191 1116.4374 1147.7255 1171.1446 1184.8936 1192.4165 1254.2492 1311.0365 1316.1367 1334.5062 1364.9801 1379.6588 1384.7595 1386.0919 1433.5748 1460.0572 1465.3664 1473.5818 1476.1539 1484.3747 1590.4897 1613.4987 2985.1457 2986.7983 3038.5746 3083.2506 3085.0773 3094.6123 3097.9384 3116.4943 3126.8809 3140.5054 3158.8723 3180.2144 3540.3584 3570.9703
redmass: 1.1177 3.8460 3.3010 3.9481 3.9138 1.9265 1.1513 1.3881 3.2104 3.5160 5.0081 2.9733 2.8713 3.4695 1.9613 1.3795 2.9951 3.3333 6.3951 4.0697 3.9285 1.7130 1.9684 2.6560 1.2546 2.6571 2.4610 1.4223 1.3626 6.1594 1.4291 1.3136 2.3233 2.0589 1.4245 1.9819 1.8667 2.4965 2.1019 1.0730 1.6021 1.4369 1.4579 1.4615 1.4672 1.7105 1.2584 3.5520 1.4458 1.2610 2.2263 1.0928 1.0465 1.0526 1.0555 2.1310 6.2179 6.1100 1.0354 1.0364 1.0860 1.0989 1.0989 1.0999 1.0993 1.0859 1.0875 1.0936 1.0991 1.0950 1.0656 1.0658
irintensity: 284.9310 0.0170 5.7450 1.7854 1.9053 0.9284 0.5372 2.3708 4.5339 1.9046 3.1832 4.3129 0.2639 6.6972 0.7940 1.9515 11.4960 16.8470 0.0760 9.5110 6.3962 58.9086 48.1333 7.1399 0.2862 21.4535 46.6128 5.4971 0.5729 0.4485 25.2115 3.1267 65.7331 34.5056 47.0598 33.9274 3.0792 13.6769 67.6769 0.0565 2.8702 3.2961 10.9053 0.8902 3.0680 37.4852 15.7217 9.4440 6.6190 30.7088 14.1354 2.6170 12.7557 14.5766 0.2544 22.2965 0.6752 6.7733 24.5771 11.0109 14.4911 14.7676 24.7111 19.5090 29.6251 8.9866 2.7761 37.7741 27.5108 5.9034 6.7889 6.8851
temp: 298.150 k
press: 1.00000 atm
elementType: 8 8 6 6 6 6 6 6 6 6 6 6 1 1 1 1 1 1 1 1 1 1 1 1 1 1
symmnumber: 1
zpe: 567857.2 jmol-1
zpe.correction: 0.216285 hartree
zpe.thermalcorrener: 0.228134 hartree
zpe.thermalcorrenthalpy: 0.229078 hartree
zpe.thermalcorrgfe: 0.178903 hartree
zpe.sumelectzpe: -538.983072 hartree
zpe.sumelectthermal: -538.971224 hartree
zpe.sumelectthermalent: -538.970280 hartree
zpe.sumelectthermalfe: -539.020454 hartree
dipole: 0.1474 -0.0485 -0.0348
dipole: 0.1590
quadrupole: -70.3611 -72.2373 -69.4550
quadrupole: 4.6744 4.3828 1.2827
quadrupole: 0.3233 -1.5528 1.2294 4.6744 4.3828 1.2827
hfenergy: -539.1993578 hartree
pointgroup: C01 [X(C10H14O2)]
dipole: -0.0576798 -0.0169011 -0.0173337 debye
dipolederiv: -0.4605345 0.2060919 -0.1077446 0.2323226 -0.6111623 -0.1594964 -0.0611262 -0.1241642 -0.6457947 -1.0157338 0.0026697 -0.0253663 0.0197759 -0.1317397 0.0086068 -0.100895 0.0566089 -0.6409365 0.2925953 -0.1191487 -0.0134421 -0.2262144 0.4015877 0.101856 -0.167539 0.0543204 0.4111977 0.7180439 -0.0373381 0.0008701 0.0012547 0.1995102 0.0006733 0.1707939 -0.0533371 0.3481425 0.2825731 0.0337865 -0.0125541 0.0243074 -0.0802148 -0.0028222 -0.0811969 0.0050511 -0.0944148 -0.0772593 -0.0217851 0.0211833 0.0315879 -0.0982443 0.0355244 0.0130477 0.1012266 -0.0870028 -0.0680409 0.0057503 0.0174892 -0.0577743 -0.0176754 0.0915898 0.0226334 0.1296406 -0.1323556 -0.1231178 0.0560193 -0.0054192 0.0846048 0.0176725 0.0469082 0.0150535 0.0462483 -0.1426048 -0.1703894 -0.0617556 -0.0296007 -0.0662792 -0.009942 0.0504681 -0.0221506 0.05399 -0.1121373 0.0064217 -0.0385781 -0.0417138 -0.0679192 0.059004 0.0883374 -0.0625126 0.0781938 -0.1172848 0.0246292 0.0906067 -0.0033128 0.0865502 0.0898288 0.0611711 -0.0108011 0.0611056 -0.1214671 0.0567147 0.0083785 -0.0540388 0.0242958 -0.0893199 0.0203 -0.0427788 0.0252478 -0.1519324 0.0217655 0.025421 0.0083746 0.049803 -0.1290603 -0.0345202 0.0124026 -0.0275105 0.0309006 0.0894281 0.0898095 0.0176557 0.0784375 -0.0736176 -0.04205 0.0163704 -0.0862792 0.0641947 0.0705719 -0.0182986 -0.0963001 -0.0155629 0.0685964 -0.045589 -0.0786845 -0.000841 -0.1023371 -0.129801 -0.038023 0.0803041 -0.0143771 0.0884327 -0.0015302 0.0676684 0.0108919 0.0964995 -0.0182095 -0.0077116 -0.1432766 -0.0265555 0.08146 -0.0039202 -0.1257684 0.0054028 -0.0821023 0.0919934 0.0209317 0.0057089 0.018809 -0.0804864 -0.0239986 0.0455737 -0.0989332 0.0766975 -0.0919619 0.0114347 0.0916076 0.0203625 0.0688372 -0.0158115 0.1044586 0.0008778 0.0896876 0.027185 -0.113791 -0.0086067 -0.1107332 -0.0407154 -0.0385756 -0.0099812 -0.0342974 0.1262311 0.1271003 0.0520093 0.0238354 0.0480883 0.023772 -0.0514568 0.0254957 -0.050568 0.1290156 0.0929176 -0.0695408 0.14668 -0.1250715 0.2800572 0.0664285 0.0857623 0.0346022 0.3183194 0.3494372 -0.0375679 0.0223159 0.0311683 -0.0016789 0.005502 0.0682952 -0.0312196 0.3479405 0.0252577 0.0701717 0.0508852 0.0882707 -0.0465329 -0.086831 0.0608523 -0.0842767 0.1146593 0.0126083 -0.0939616 -0.0035917 -0.1131819 -0.0645185 -0.0516736 -0.005905 -0.0535318 0.1351637 -0.1341946 -0.0155805 0.0580576 -0.0159695 0.09615 -0.0190902 0.0609316 -0.018449 0.1417205 unknown
polarizability: 140.6791337|3.2904189|107.2813208|-10.4835084|8.0594694|81.9598292 unknown
InChI: InChI=1S/C10H14O2/c1-8(11)10(2,12)9-6-4-3-5-7-9/h3-8,11-12H,1-2H3
charge 0 multiplicity 1
26 atoms
O  1.538035 -1.176337 -1.075144
O  3.386132 0.300077 0.484098
C  1.116383 0.135457 -0.516142
C  1.941095 0.362973 0.805057
C  -0.38447 0.048151 -0.225283
C  1.435231 1.242867 -1.545932
C  1.597308 -0.628437 1.925362
C  -1.070166 1.169442 0.311744
C  -1.108988 -1.144104 -0.466987
C  -2.451025 1.099632 0.599391
C  -2.491905 -1.213039 -0.182005
C  -3.169194 -0.093919 0.353077
H  1.791046 1.403833 1.143442
H  1.052491 2.224139 -1.215986
H  0.962965 1.002929 -2.514575
H  2.529978 1.334064 -1.672668
H  2.284518 -0.482868 2.777192
H  1.690638 -1.667623 1.557362
H  0.563223 -0.491044 2.283204
H  -0.531788 2.105293 0.506086
H  -0.576494 -2.002723 -0.883658
H  2.355858 -1.018475 -1.61089
H  3.639883 -0.659156 0.47081
H  -2.965814 1.974773 1.012021
H  -3.03992 -2.141776 -0.378642
H  -4.241322 -0.148128 0.573165
