program: Gaussian 09
title: 000234224
version: EM64L-G09RevD.01
frameworkgroup: C1[X(C7H11IO5S)]
method: RPBEPBE
basis: SDD
operation: Freq
keyword: #p
keyword: freq=noraman
keyword: PBEPBE/SDD
title: #p freq=noraman PBEPBE/SDD
converged: YES YES NO NO
title: Mulliken charges:
elementType: I S O O O O O C C C C C C C H H H H H H H H H H H
charge: 0.068648 1.057257 -0.240027 -0.269686 -0.394161 -0.494807 -0.520941 -0.112716 -0.135543 -0.093084 -0.567846 -0.341746 -0.290190 -0.740187 0.314165 0.298577 0.274986 0.330788 0.215508 0.249510 0.224477 0.269557 0.283740 0.332454 0.281266
chargesum: 0.00000
title: Mulliken charges with hydrogens summed into heavy atoms:
elementType: I S O O O O O C C C C C C C
charge: 0.068648 1.057257 -0.240027 -0.269686 -0.394161 -0.494807 -0.520941 0.201449 0.163034 0.181902 -0.237058 0.123272 0.203844 0.157274
polarizability: 1.81162670e+02 9.46497556e+00 1.32731076e+02 9.07087547e+00 4.13649041e+00 1.07174602e+02
1716.lowfreq: -14.8806 -9.1995 -0.0021 -0.0018 -0.0012 6.8144 27.8987 45.1043 59.9524
frequency: 27.6482 45.0903 59.9398 97.4146 108.2245 142.8130 162.3091 175.5082 203.4292 205.2372 233.0105 250.1348 266.1496 284.5893 298.5383 345.0845 374.4046 498.6760 534.3706 563.2216 574.0682 593.4598 636.8255 720.2225 778.0679 810.7459 832.9265 834.8966 886.9486 895.7718 926.1734 928.9075 966.7723 986.3836 991.6147 1002.7172 1017.6965 1049.2663 1058.4286 1060.3354 1090.1943 1133.1498 1158.1010 1175.3820 1189.6913 1221.4145 1263.5125 1291.5849 1295.6373 1299.0635 1312.3370 1322.8401 1334.0122 1348.2873 1409.9102 1430.8349 1466.5700 1491.1366 2956.5677 2998.6287 3016.9737 3019.0810 3087.0290 3104.6868 3108.8548 3113.4739 3121.9755 3168.0024 3184.3862
redmass: 11.4338 5.6484 6.3726 7.6353 7.5427 5.3568 3.7151 5.0846 1.4230 2.7294 5.5658 4.4038 6.1693 4.4576 2.8937 8.9301 9.6356 6.6541 7.8787 3.4718 7.8468 6.9933 3.5358 6.3017 4.6006 5.5823 5.9904 5.6476 3.4620 2.6375 3.2129 3.2945 3.1280 2.4590 1.7292 1.8354 3.4608 2.6970 1.7054 1.6954 3.4412 1.2339 1.2067 1.1613 2.0146 1.3995 1.3514 1.4968 1.1783 1.1706 1.2433 1.1294 1.2766 1.2893 1.0483 1.0522 1.0793 1.0784 1.0691 1.0664 1.0249 1.0830 1.0886 1.0938 1.0958 1.0957 1.0895 1.1090 1.1077
irintensity: 0.9968 4.2254 0.8833 9.6289 1.9760 1.9803 9.2937 3.6801 0.2000 0.2729 1.2713 0.8876 8.4058 1.5837 9.6153 37.4656 44.7085 9.5220 29.6984 48.2169 20.6875 27.2887 5.3334 5.7547 23.3333 17.2049 23.0430 72.6706 9.5911 25.8839 35.7492 22.5118 129.1049 22.0056 55.2096 3.3184 12.9533 39.5136 49.5874 12.0200 54.5373 12.3952 9.9212 29.5524 6.1004 7.5386 2.7573 1.3726 2.5674 12.6202 6.4731 4.6496 2.8237 8.7805 5.7121 11.5114 5.3892 11.7966 38.5084 33.4962 14.9098 19.9289 5.7428 8.7322 26.3390 1.5543 0.5562 15.5025 0.4902
temp: 298.150 k
press: 1.00000 atm
elementType: 53 16 8 8 8 8 8 6 6 6 6 6 6 6 1 1 1 1 1 1 1 1 1 1 1
symmnumber: 1
zpe: 475762.9 jmol-1
zpe.correction: 0.181209 hartree
zpe.thermalcorrener: 0.196260 hartree
zpe.thermalcorrenthalpy: 0.197204 hartree
zpe.thermalcorrgfe: 0.136562 hartree
zpe.sumelectzpe: -1057.718211 hartree
zpe.sumelectthermal: -1057.703160 hartree
zpe.sumelectthermalent: -1057.702216 hartree
zpe.sumelectthermalfe: -1057.762858 hartree
dipole: -1.9340 -0.0504 3.2916
dipole: 3.8180
quadrupole: -129.2636 -102.0164 -101.1091
quadrupole: -3.0491 7.4266 -4.4259
quadrupole: -18.4672 8.7800 9.6873 -3.0491 7.4266 -4.4259
hfenergy: -1057.8994198 hartree
pointgroup: C01 [X(C7H11I1O5S1)]
dipole: 0.706065 0.091944 1.3226494 debye
dipolederiv: -0.2006959 -0.1569664 0.0126437 -0.2676579 -0.4281493 0.0389094 0.0509344 0.0603522 -0.1177151 1.9036161 -0.0043852 0.0316439 -0.2778159 1.2249825 0.0484117 0.0874829 0.0215642 1.2129689 -0.8400239 -0.2018795 0.0367046 -0.3063923 -0.7974852 0.0002717 -0.0845694 -0.0671214 -0.347931 -0.6935987 -0.0421029 -0.1227274 -0.1098306 -0.3318244 -0.0556934 -0.298083 -0.128547 -0.6195201 -0.9652807 0.0373812 0.0288722 0.1347975 -0.469968 -0.0461604 0.0555391 -0.0181711 -0.4047996 -0.8186537 -0.0496344 -0.030284 -0.1016308 -0.473824 -0.0515856 0.0425734 -0.0251635 -0.4852348 -0.5940106 -0.0520604 0.0292176 0.1013117 -0.5559959 0.0755635 -0.0339145 0.0649936 -0.5899721 0.0036178 0.0654422 0.0137433 0.1002514 0.1192893 0.0795679 0.1702448 0.0954996 0.4278787 0.2846747 0.1607313 0.0220359 0.170586 0.4406594 -0.0082502 0.1858661 0.2246924 0.2255702 0.5029026 -0.0049535 -0.029935 0.3829349 0.0113413 0.0130407 -0.3805974 0.2397528 0.2435258 0.0724918 0.2353153 -0.0961271 0.5855621 0.7654606 -0.1252856 -0.1602957 -0.2844493 -0.0108475 0.5704897 0.2839544 -0.0872057 -0.1121873 0.3793375 0.0260924 0.0722985 -0.1712193 0.2907069 0.5519679 0.0275334 0.2543554 -0.2179789 0.0821523 -0.0208981 0.2517165 0.0208553 0.2620814 -0.244011 -0.0401853 -0.0135449 0.0257711 -0.0622584 -0.0056747 -0.0325597 -0.0169016 -0.0922245 0.1034984 0.0296478 -0.0456172 0.0132185 0.0078954 0.0262914 -0.0304401 0.0109526 -0.0043173 0.032385 -0.0297391 0.0459113 -0.0385318 -0.0003622 0.0164236 0.0654976 0.0305055 -0.0394075 -0.0152271 0.0009937 -0.0394393 -0.0722237 0.0472742 -0.0050458 0.0413296 -0.051126 -0.0909582 -0.0356001 -0.0643303 -0.0022477 -0.0012751 -0.0681468 0.0524555 -0.0119192 0.0275774 0.0872565 0.0094156 -0.0564846 0.0263107 -0.0202408 0.0953317 -0.010005 0.0511515 0.0767979 -0.1407673 0.0006223 -0.0709168 -0.0026427 -0.0335669 -0.089807 -0.0532428 0.0000354 -0.0979261 0.0572972 -0.0610378 -0.0755396 0.0205252 0.0521187 -0.0866001 0.1388412 0.0160203 0.0921532 0.0150658 0.063993 -0.0055276 -0.048349 0.0002468 0.042399 -0.1128642 -0.0633838 -0.0649815 -0.0006168 0.1130457 -0.0276273 0.010166 -0.0284751 0.0275835 0.0075314 0.022272 0.0152412 0.0152555 0.1982941 -0.0144717 0.0032691 -0.0614932 0.0867121 -0.0198612 -0.039824 -0.032848 0.0527363 0.0571245 0.0558054 -0.0172789 0.0825016 0.0340025 -0.0088333 0.0226248 -0.0224831 0.0539688 unknown
polarizability: 169.0107845|23.815186|146.1163204|-3.6071603|-1.2806925|105.9412435 unknown
InChI: InChI=1S/C7H11IO5S/c1-14(9,10)13-5-3-12-6-4(8)2-11-7(5)6/h4-7H,2-3H2,1H3
charge 0 multiplicity 1
25 atoms
I  3.40935 2.306753 0.09503
S  -3.009049 0.017964 -0.276435
O  1.864378 -1.781438 -0.569036
O  0.280754 0.718048 0.896407
O  -1.637414 -1.240318 0.157564
O  -4.397303 -0.795505 -0.367965
O  -2.486044 0.91796 -1.523288
C  0.396975 0.177258 -0.480829
C  1.867136 -0.291734 -0.654231
C  -0.445535 -1.127307 -0.674593
C  2.606722 0.279903 0.576725
C  0.507976 -2.253115 -0.210024
C  1.504315 0.350173 1.641695
C  -2.919887 1.008225 1.344045
H  0.081142 0.976828 -1.165076
H  2.336065 -0.021662 -1.61193
H  -0.695439 -1.225965 -1.748204
H  3.490314 -0.313918 0.849782
H  0.409482 -2.403346 0.882724
H  0.346548 -3.207181 -0.733547
H  1.387813 -0.6489 2.114402
H  1.660488 1.10965 2.420882
H  -3.245961 0.309829 2.126411
H  -1.859879 1.285884 1.440342
H  -3.602149 1.861114 1.219948
