program: Gaussian 09
title: 000236809
version: EM64L-G09RevD.01
frameworkgroup: C1[X(C17H13NO)]
method: RPBEPBE
basis: SDD
operation: Freq
keyword: #p
keyword: freq=noraman
keyword: PBEPBE/SDD
title: #p freq=noraman PBEPBE/SDD
converged: NO YES NO NO
title: Mulliken charges:
elementType: O N C C C C C C C C C C C C C C C C C H H H H H H H H H H H H H
charge: -0.268253 -0.408384 0.146887 0.220033 0.196154 -0.352365 -0.380039 -0.360500 0.089165 -0.246348 -0.211660 -0.288860 0.469859 -0.277604 -0.380037 -0.388576 -0.238210 -0.239522 -0.237605 0.311520 0.256327 0.292933 0.230162 0.224975 0.224019 0.198100 0.268649 0.222290 0.238370 0.226660 0.230333 0.231528
chargesum: 0.00000
title: Mulliken charges with hydrogens summed into heavy atoms:
elementType: O N C C C C C C C C C C C C C C C C C
charge: -0.268253 -0.096864 0.146887 0.220033 0.196154 -0.096038 -0.087106 -0.130338 0.089165 -0.021373 0.012358 -0.090759 0.469859 -0.008955 -0.157747 -0.150206 -0.011550 -0.009190 -0.006077
polarizability: 4.14642225e+02 1.07740116e+00 1.99302890e+02 -2.05921776e-01 1.01716185e-01 7.36525376e+01
1716.lowfreq: -0.0006 0.0004 0.0005 4.2197 9.2320 11.3058 26.9614 29.8942 52.7984
frequency: 26.9152 29.2689 52.7981 93.4768 110.7620 139.0556 156.9456 200.2856 219.8387 260.2254 276.1709 302.2731 392.9545 403.5590 425.9453 442.1169 491.1706 503.9650 561.6515 561.8204 572.9398 582.4098 611.4374 616.3110 630.2755 690.2138 709.6822 758.1089 759.5759 765.8511 768.7414 782.7941 821.2984 847.1241 865.6128 867.5079 871.6019 882.6052 925.7056 950.6233 969.1601 978.8823 989.1960 993.1010 995.9521 1010.6937 1014.3691 1026.4934 1082.7633 1092.2108 1134.6144 1146.7140 1167.0678 1173.5934 1189.5051 1217.8865 1241.0413 1247.8532 1281.1251 1303.8531 1310.2577 1333.8159 1361.0888 1385.8458 1395.6122 1423.3688 1440.4063 1451.3312 1483.8491 1485.3149 1502.9964 1541.2730 1581.4258 1589.2071 1610.6643 1632.1283 1641.5339 3095.2434 3123.3793 3125.0450 3127.9889 3129.2575 3139.8930 3140.7159 3150.0370 3159.7823 3166.1281 3187.8571 3229.1692 3599.8017
redmass: 6.2372 3.8535 5.3224 4.8858 4.7844 5.5789 3.2600 6.2838 3.8366 7.1058 3.0139 5.3226 6.8029 2.7640 2.9281 4.8818 2.8349 5.3591 1.7030 5.5162 2.9541 6.2387 2.2248 6.4147 6.6065 2.1610 2.0710 1.3126 6.2306 6.1498 2.5790 2.3713 1.7226 1.2877 4.7075 1.4287 4.7179 1.9272 1.4499 1.3678 4.7947 1.3858 6.1480 1.3096 1.3121 2.0832 1.2274 2.1804 1.5998 2.1294 1.6967 1.5629 1.1565 1.0656 1.1226 1.6251 1.7239 2.1588 2.2885 2.3771 1.4538 1.2883 2.5290 6.5956 5.9515 2.5079 2.3343 3.6125 2.9263 2.4231 7.2531 6.1250 5.6879 6.5210 5.9812 6.9978 5.7027 1.0893 1.0852 1.0891 1.0858 1.0882 1.0916 1.0914 1.0964 1.0978 1.1016 1.0960 1.0976 1.0810
irintensity: 0.7047 1.0242 0.4623 0.3230 0.4652 1.2906 0.0183 1.0023 10.4561 5.4578 0.6125 0.0492 0.3843 0.0194 11.7836 4.1737 8.9651 9.2874 64.3968 34.6179 11.2692 8.9164 28.8681 0.1058 2.1218 22.5831 35.4884 90.1714 7.7698 31.0867 35.9000 55.2422 2.4135 0.3554 0.5528 0.1068 13.2762 14.3268 0.0008 4.7590 99.6790 0.2327 0.7346 1.2014 4.6672 18.2207 38.7406 7.5563 7.6655 26.3769 150.6396 12.3805 11.0820 1.3330 10.7433 19.0406 10.4911 28.0188 0.3412 51.5918 5.4986 30.6603 3.4366 0.3818 139.4039 126.4598 30.1863 38.2114 3.4291 21.0417 187.3207 245.4069 16.3756 5.4655 0.4774 14.1272 217.0487 0.5154 9.8937 3.0592 0.2205 8.8843 5.2907 20.6569 42.0816 37.5905 35.4436 8.0801 0.4003 77.4103
temp: 298.150 k
press: 1.00000 atm
elementType: 8 7 6 6 6 6 6 6 6 6 6 6 6 6 6 6 6 6 6 1 1 1 1 1 1 1 1 1 1 1 1 1
symmnumber: 1
zpe: 656343.8 jmol-1
zpe.correction: 0.249988 hartree
zpe.thermalcorrener: 0.265142 hartree
zpe.thermalcorrenthalpy: 0.266086 hartree
zpe.thermalcorrgfe: 0.205875 hartree
zpe.sumelectzpe: -784.295417 hartree
zpe.sumelectthermal: -784.280263 hartree
zpe.sumelectthermalent: -784.279318 hartree
zpe.sumelectthermalfe: -784.339529 hartree
dipole: 0.3520 5.3520 -0.0082
dipole: 5.3635
quadrupole: -83.1719 -93.4781 -119.0671
quadrupole: -9.2692 0.0018 -0.0298
quadrupole: 15.4005 5.0943 -20.4948 -9.2692 0.0018 -0.0298
hfenergy: -784.5454047 hartree
pointgroup: C01 [X(C17H13N1O1)]
dipole: 0.1455629 2.1035318 -0.0824958 debye
polarizability: 414.6462451|0.3732985|199.1263156|0.545533|-4.643493|73.825092 unknown
InChI: InChI=1S/C17H13NO/c19-17(11-10-13-6-2-1-3-7-13)15-12-18-16-9-5-4-8-14(15)16/h1-12,18H
charge 0 multiplicity 1
32 atoms
O  -0.471582 -1.86188 0.073377
N  -2.86787 2.131978 -0.088523
C  -2.914027 -0.152416 0.009667
C  -3.73593 1.023316 -0.040188
C  -1.521136 0.288099 -0.009472
C  -1.550041 1.694522 -0.071445
C  -3.535568 -1.426626 0.064691
C  -5.145495 0.972997 -0.036097
C  -0.337515 -0.588291 0.026446
C  -4.943869 -1.487132 0.069272
C  -5.739595 -0.305098 0.019647
C  1.013198 0.04321 0.009352
C  3.542405 -0.274564 0.028601
C  2.14476 -0.726068 0.038144
C  3.923214 1.099713 -0.008319
C  4.575368 -1.25654 0.057763
C  5.2811 1.471612 -0.015791
C  5.935858 -0.885229 0.050203
C  6.295227 0.481921 0.013285
H  -3.162795 3.105777 -0.13083
H  -0.730905 2.40989 -0.104848
H  -2.914735 -2.324909 0.101273
H  -5.758639 1.880176 -0.074139
H  -5.441955 -2.462007 0.111813
H  -6.831946 -0.390554 0.024822
H  1.072961 1.137484 -0.02628
H  1.977094 -1.813241 0.07269
H  3.153097 1.878858 -0.030484
H  4.298072 -2.317363 0.08651
H  5.556029 2.532042 -0.044361
H  6.713082 -1.656875 0.073199
H  7.350741 0.775599 0.007222
