program: Gaussian 09
title: 000236816
version: EM64L-G09RevD.01
frameworkgroup: C1[X(C19H19N)]
method: RPBEPBE
basis: SDD
operation: Freq
keyword: #pfreq=noraman
keyword: PBEPBE/SDD
title: #p freq=noraman PBEPBE/SDD
converged: YES YES NO NO
title: Mulliken charges:
elementType: N C C C C C C C C C C C C C C C C C C C H H H H H H H H H H H H H H H H H H H
charge: -0.089783 -0.551884 0.417467 -0.513171 0.143849 0.405180 -0.469026 0.460333 -0.633820 -0.356896 -0.460620 -0.247212 -0.439700 -0.438739 -0.367294 -0.269770 -0.245595 -0.223909 -0.233381 -0.240969 0.198449 0.247319 0.188560 0.223463 0.235283 0.254414 0.222352 0.184892 0.286205 0.237389 0.225008 0.234927 0.234018 0.253404 0.223955 0.225539 0.225045 0.226924 0.227791
chargesum: 0.00000
title: Mulliken charges with hydrogens summed into heavy atoms:
elementType: N C C C C C C C C C C C C C C C C C C C
charge: -0.089783 -0.106117 0.417467 -0.101148 0.143849 0.405180 -0.233743 0.460333 0.027838 -0.070691 -0.223231 -0.022204 -0.204772 -0.204720 -0.113890 -0.045815 -0.020056 0.001136 -0.006456 -0.013178
polarizability: 2.43052072e+02 1.11467935e+01 2.44800751e+02 -1.14219344e+01 2.30921126e+01 1.36718100e+02
1716.lowfreq: -11.1754 -0.0009 -0.0008 -0.0006 4.6785 9.2715 16.8712 29.2734 53.0111
frequency: 16.0638 29.1977 53.0059 69.9047 71.8685 104.8214 154.5586 178.9016 195.7995 228.8068 264.8763 280.4175 323.9734 330.9254 338.9070 405.8588 408.2742 422.3212 432.1966 473.7552 490.4302 502.0598 520.1540 551.2197 597.1695 616.6803 616.7352 652.3699 706.4957 713.2719 741.4374 750.1647 784.1603 792.1848 807.9324 817.2263 827.4186 859.6068 869.4089 886.0236 917.9089 921.5934 960.7587 968.4677 970.9929 981.4683 984.4220 990.1186 991.6571 997.2951 1010.1844 1024.2918 1026.6733 1052.1926 1079.8691 1082.1845 1111.6093 1130.3362 1149.8184 1170.7570 1171.2403 1178.0429 1183.0943 1183.4960 1213.5203 1231.8689 1241.6260 1247.9807 1271.0717 1278.9973 1319.0897 1356.1873 1366.4918 1380.5725 1387.3712 1408.2123 1419.9383 1429.3898 1439.0579 1442.8018 1455.8860 1461.6925 1467.5083 1479.1742 1480.6574 1483.8865 1517.3751 1590.0255 1594.0796 1598.4965 1613.6077 1633.8377 2840.2995 2844.1236 2862.2574 3003.5836 3006.5221 3031.3157 3093.7982 3114.6446 3115.3791 3117.8305 3120.9583 3124.9662 3131.5014 3133.5822 3144.2774 3152.4727 3153.8366 3161.4637 3176.8692
redmass: 4.6926 4.5027 4.1087 3.6984 4.0247 3.4861 3.6804 4.0433 4.5795 1.3767 2.3397 3.2826 2.3768 3.1018 2.7755 2.8471 2.7300 2.7899 3.2301 3.2402 3.8785 5.4233 4.2518 3.9980 4.6735 6.0148 4.1967 4.0001 2.0790 3.5730 1.4124 1.5997 3.4113 2.6877 1.8838 2.7453 2.7418 1.2528 3.1763 2.1766 1.4251 1.4140 1.3888 1.9090 1.9698 1.3828 1.4000 4.5322 1.4454 1.3623 2.1740 2.7444 2.1256 2.5534 1.7363 1.8792 1.3309 2.4816 1.4260 1.0609 1.2089 1.2562 1.1722 1.3137 2.5793 1.5657 1.5708 1.8628 1.4835 1.7743 1.3134 1.5123 1.5961 1.9713 4.5657 3.0493 5.0277 1.2271 2.1126 2.1947 2.5317 1.0759 1.1096 1.0992 1.2642 1.6267 3.8790 7.5567 6.1069 5.2943 6.1345 6.5765 1.0714 1.0681 1.0596 1.0866 1.0862 1.0732 1.1001 1.0867 1.0865 1.0860 1.0863 1.0907 1.0904 1.0913 1.0961 1.0983 1.0981 1.1015 1.0952
irintensity: 0.0046 0.1985 0.0402 0.3441 0.5949 2.2409 0.2446 2.1565 0.9035 0.5991 1.3471 2.7456 0.9631 0.2705 2.7376 0.0659 5.7632 5.2887 2.4288 0.0079 6.8306 1.9094 4.3090 5.1278 6.0733 0.2264 1.0799 0.8609 44.5898 0.1031 29.1803 49.7130 13.5279 34.7219 86.6522 6.8050 12.6949 0.3882 2.8426 6.9461 4.2199 5.7648 1.1048 2.7790 13.3841 1.5852 3.1040 0.1893 0.7839 8.6532 43.6402 8.2471 4.7029 7.3646 7.7466 5.4261 2.9543 15.2080 1.7724 0.1881 0.7509 1.9148 3.3908 3.0646 3.6950 3.6121 4.9135 17.3491 3.4404 1.1762 2.8636 16.8479 3.8215 16.8659 0.8991 1.5342 0.5062 4.4121 12.4565 2.8345 0.2350 10.1257 7.4905 7.3654 14.7108 6.5438 10.1331 1.1219 0.9841 5.1344 2.5892 0.1812 37.3868 69.6238 212.1839 15.7212 18.8691 31.9324 29.4060 6.6046 5.2649 0.5952 0.9992 15.9816 25.7996 13.3884 41.6833 51.8442 21.8420 23.1751 7.2062
temp: 298.150 k
press: 1.00000 atm
elementType: 7 6 6 6 6 6 6 6 6 6 6 6 6 6 6 6 6 6 6 6 1 1 1 1 1 1 1 1 1 1 1 1 1 1 1 1 1 1 1
symmnumber: 1
zpe: 850934.5 jmol-1
zpe.correction: 0.324104 hartree
zpe.thermalcorrener: 0.341050 hartree
zpe.thermalcorrenthalpy: 0.341994 hartree
zpe.thermalcorrgfe: 0.277708 hartree
zpe.sumelectzpe: -788.756528 hartree
zpe.sumelectthermal: -788.739582 hartree
zpe.sumelectthermalent: -788.738638 hartree
zpe.sumelectthermalfe: -788.802925 hartree
dipole: 0.4459 -0.8559 0.0426
dipole: 0.9660
quadrupole: -110.4562 -105.2970 -119.8836
quadrupole: 0.5194 -2.3122 2.9524
quadrupole: 1.4228 6.5819 -8.0047 0.5194 -2.3122 2.9524
hfenergy: -789.0806323 hartree
pointgroup: C01 [X(C19H19N1)]
dipole: 0.1776371 -0.3342251 -0.0343242 debye
polarizability: 241.4857215|14.3196983|237.6896521|-15.2463771|34.9490266|145.3955491 unknown
InChI: InChI=1S/C19H19N/c1-20(14-16-8-3-2-4-9-16)15-18-12-7-11-17-10-5-6-13-19(17)18/h2-13H,14-15H2,1H3
charge 0 multiplicity 1
39 atoms
N  0.760331 -1.56579 0.709511
C  0.091014 -1.409754 -0.614819
C  -1.387241 -1.052592 -0.530918
C  2.220449 -1.802893 0.549006
C  -1.830885 0.224413 -0.016529
C  -3.250953 0.524219 0.005816
C  -2.340936 -1.967084 -0.997299
C  2.974267 -0.579821 0.039321
C  0.124449 -2.601931 1.551108
C  -0.915066 1.219931 0.463846
C  -4.187354 -0.44902 -0.477075
C  -3.739872 -1.673987 -0.971079
C  -3.692898 1.795776 0.502483
C  3.779704 -0.64688 -1.123411
C  2.90766 0.64456 0.754116
C  -1.375679 2.451543 0.935941
C  -2.77594 2.744402 0.958377
C  4.50598 0.483791 -1.567003
C  3.630331 1.77494 0.31547
C  4.433208 1.698347 -0.848315
H  0.190122 -2.350754 -1.215273
H  0.642556 -0.622393 -1.164155
H  2.426428 -2.673317 -0.126647
H  2.609613 -2.078283 1.548824
H  -2.004278 -2.933257 -1.392831
H  -0.938026 -2.353695 1.707902
H  0.622657 -2.631408 2.536413
H  0.175252 -3.627001 1.102863
H  0.153119 0.990356 0.473834
H  -5.25813 -0.212706 -0.455208
H  -4.454655 -2.416246 -1.343092
H  -4.768278 2.011781 0.514194
H  3.8386 -1.587871 -1.684956
H  2.28254 0.697404 1.653668
H  -0.661741 3.201428 1.295179
H  -3.123156 3.713558 1.333866
H  5.123181 0.416951 -2.470226
H  3.572288 2.713171 0.87925
H  4.994739 2.575312 -1.189754
