program: Gaussian 09
title: 000236797
version: EM64L-G09RevD.01
frameworkgroup: C1[X(C12H11NO3)]
method: RPBEPBE
basis: SDD
operation: Freq
keyword: #p
keyword: freq=noraman
keyword: PBEPBE/SDD
title: #p freq=noraman PBEPBE/SDD
converged: YES YES NO NO
title: Mulliken charges:
elementType: O O O N C C C C C C C C C C C C H H H H H H H H H H H
charge: -0.248912 -0.427161 -0.231791 -0.453009 0.343833 0.221483 -0.343610 -0.359598 -0.227723 -0.255180 -0.194235 0.184319 -0.254711 -0.600039 -0.267448 0.172624 0.309656 0.234869 0.325835 0.233640 0.233040 0.218444 0.282524 0.226659 0.236334 0.255760 0.384397
chargesum: 0.00000
title: Mulliken charges with hydrogens summed into heavy atoms:
elementType: O O O N C C C C C C C C C C C C
charge: -0.248912 -0.042764 -0.231791 -0.127175 0.343833 0.221483 -0.033955 -0.124729 0.005917 -0.022140 0.024210 0.184319 0.027813 -0.137045 -0.011688 0.172624
polarizability: 2.55084077e+02 1.25768507e+01 1.67265962e+02 1.62985658e+01 -3.84152569e+00 7.72962309e+01
1716.lowfreq: -8.4260 -5.1267 0.0000 0.0005 0.0007 3.4336 24.2835 42.5494 54.7079
frequency: 24.1225 42.5363 54.6997 75.7554 106.4732 139.7743 142.3502 170.8608 179.4182 204.1852 234.7643 295.9162 329.4693 383.6515 404.7716 436.7952 477.0946 528.7264 537.9376 566.6580 586.8203 594.1441 645.0563 647.4318 674.9224 722.8480 734.2090 761.9479 775.7565 786.8724 841.6710 889.5198 890.9007 925.8271 945.9706 959.8344 962.6157 997.4746 998.8503 1006.9869 1029.8036 1045.0398 1055.9507 1122.6949 1176.4269 1202.0551 1218.7877 1230.0843 1251.3183 1265.0150 1298.0987 1311.6111 1329.5429 1378.6623 1419.6462 1449.2620 1466.6989 1510.7550 1572.6336 1588.1166 1608.9853 1627.4678 1637.6542 1650.1975 3088.2198 3100.0758 3126.5238 3142.2791 3145.1257 3151.2148 3165.1008 3193.4570 3203.4096 3466.0536 3524.6136
redmass: 5.6872 8.3615 6.2647 4.8113 3.5137 3.8919 3.5194 3.4010 3.4706 5.2396 4.3108 3.9552 4.9065 6.2378 4.2984 3.2749 4.0670 3.3550 3.4462 2.9095 2.1498 5.1498 1.8933 2.2131 4.1005 3.7533 1.4070 2.5939 2.1882 2.2159 5.2669 1.5612 1.9256 6.3133 1.3737 3.1416 1.5407 1.1287 1.3126 1.1288 1.7440 2.1999 2.1157 1.7048 1.1236 2.1274 2.2440 1.8190 1.5801 1.3703 1.8453 1.4368 2.0770 5.9970 1.6410 1.6738 2.2808 2.2161 7.9851 4.0701 5.0705 4.5651 8.1564 6.1686 1.0791 1.0724 1.0876 1.0902 1.0977 1.0864 1.0984 1.0953 1.1140 1.0765 1.0642
irintensity: 0.7466 0.1670 0.0100 2.9108 0.5900 1.6794 1.1459 3.6375 6.2511 2.2613 0.6188 2.4266 1.5083 7.5102 5.9989 6.1822 14.5973 3.8183 63.9933 23.6239 39.0763 9.5568 29.3712 62.9707 3.2335 6.7654 46.4520 35.4001 45.2910 62.9967 9.1162 0.9513 6.1546 13.8672 48.3196 14.8295 5.0831 57.2635 0.9174 19.5119 7.9615 43.3617 324.3815 1.8636 0.1086 18.4555 50.5168 0.4848 2.6696 35.2416 14.5911 15.6746 116.0071 35.3761 44.1574 66.0045 16.5477 241.8776 183.1433 30.9645 10.3694 23.1772 319.9134 48.1044 16.1409 1.2693 6.5324 13.5138 4.0215 6.1316 28.0095 9.1469 18.0623 51.2409 54.2114
temp: 298.150 k
press: 1.00000 atm
elementType: 8 8 8 7 6 6 6 6 6 6 6 6 6 6 6 6 1 1 1 1 1 1 1 1 1 1 1
symmnumber: 1
zpe: 534959.2 jmol-1
zpe.correction: 0.203755 hartree
zpe.thermalcorrener: 0.218724 hartree
zpe.thermalcorrenthalpy: 0.219669 hartree
zpe.thermalcorrgfe: 0.159886 hartree
zpe.sumelectzpe: -743.143874 hartree
zpe.sumelectthermal: -743.128905 hartree
zpe.sumelectthermalent: -743.127961 hartree
zpe.sumelectthermalfe: -743.187743 hartree
dipole: -1.4659 4.5287 -1.0903
dipole: 4.8833
quadrupole: -83.8454 -94.5901 -96.5252
quadrupole: 7.9676 -1.3906 1.6906
quadrupole: 7.8081 -2.9365 -4.8716 7.9676 -1.3906 1.6906
hfenergy: -743.3476292 hartree
pointgroup: C01 [X(C12H11N1O3)]
dipole: 0.7207513 1.302941 1.2141207 debye
polarizability: 247.0749137|-33.7187872|152.615956|18.7094748|36.0202997|99.9554002 unknown
InChI: InChI=1S/C12H11NO3/c1-2-9-5-3-4-6-10(9)13-11(14)7-8-12(15)16/h2-8,13,15H,1H2
charge 0 multiplicity 1
27 atoms
O  -0.492987 -2.05743 -1.697593
O  -4.47648 1.352032 1.16008
O  -4.989307 0.322842 -0.86764
N  0.189202 -0.206247 -0.395814
C  1.57946 -0.438286 -0.224859
C  2.363943 0.587958 0.408243
C  2.182849 -1.669083 -0.599916
C  3.722536 0.299172 0.707573
C  3.547043 -1.896723 -0.330281
C  4.322278 -0.920319 0.337231
C  1.847807 1.922465 0.797443
C  -0.755641 -0.99342 -1.052083
C  -2.166964 -0.50213 -0.970259
C  0.921553 2.703784 0.166157
C  -2.711746 0.232985 0.041776
C  -4.147172 0.603388 0.017378
H  1.572219 -2.425572 -1.095532
H  4.318274 1.066601 1.216182
H  -0.153674 0.660695 0.031065
H  3.99936 -2.847667 -0.631654
H  5.377026 -1.10649 0.563696
H  2.323391 2.343188 1.696137
H  -2.812826 -0.851062 -1.785742
H  0.664667 3.688971 0.568626
H  0.461938 2.439727 -0.793764
H  -2.149226 0.560279 0.923432
H  -5.442124 1.591442 1.127918
