program: Gaussian 09
title: 000236778
version: EM64L-G09RevD.01
frameworkgroup: C1[X(C8H18N2)]
method: RPBEPBE
basis: SDD
operation: Freq
keyword: #pfreq=noraman
keyword: PBEPBE/SDD
title: #p freq=noraman PBEPBE/SDD
converged: YES YES NO NO
title: Mulliken charges:
elementType: N N C C C C C C C C H H H H H H H H H H H H H H H H H H
charge: -0.142394 -0.576351 -0.047224 -0.002095 -0.475296 -0.498239 -0.324380 -0.740245 -0.719757 -0.411487 0.224050 0.193191 0.225469 0.208567 0.217383 0.223638 0.165924 0.228563 0.224759 0.218891 0.217240 0.203949 0.222864 0.213517 0.223645 0.191285 0.258629 0.275903
chargesum: 0.00000
title: Mulliken charges with hydrogens summed into heavy atoms:
elementType: N N C C C C C C C C
charge: -0.142394 -0.041819 0.176826 0.191096 -0.041260 -0.057218 0.070107 -0.079355 -0.079427 0.003443
polarizability: 1.11707061e+02 -2.90245663e-01 9.95389413e+01 -9.75842770e-01 -7.20064284e-01 8.50214987e+01
1716.lowfreq: -22.2739 -12.3337 0.0008 0.0009 0.0009 10.4276 41.7016 62.5671 83.3617
frequency: 39.8062 62.5077 83.3078 131.6839 153.9409 196.2766 213.1209 235.5613 272.4415 282.2578 336.3284 359.0843 388.7409 411.9593 497.0554 590.1959 639.1960 655.0366 729.8802 777.7866 801.9072 853.3611 873.3718 921.4531 945.9286 951.2071 971.2713 1013.5967 1044.8859 1054.4604 1080.8541 1102.9980 1126.0167 1126.7011 1142.2812 1169.6211 1179.9145 1200.6603 1211.3588 1258.8720 1276.4103 1287.4414 1290.3018 1302.7213 1322.9193 1336.7650 1339.2358 1352.0179 1371.9287 1380.4852 1393.0002 1459.0609 1461.4994 1467.0487 1470.7906 1476.6509 1483.9073 1486.4328 1493.4570 1635.8385 2824.7410 2853.0744 2881.3691 2974.1026 2975.4897 2987.5827 3004.4828 3017.9306 3035.9514 3052.6616 3057.0022 3066.4437 3069.2476 3073.4694 3080.1949 3084.3975 3459.9840 3588.1982
redmass: 2.3743 2.7881 2.0606 2.9073 2.2612 1.2694 1.1085 1.0822 1.7569 2.4377 2.6874 2.9896 2.3065 2.5354 2.6242 1.3238 3.3635 2.3400 2.9392 1.6855 1.2089 2.5560 1.8250 1.4792 1.6423 1.7305 2.4490 1.3982 1.6668 1.8341 1.9389 2.5734 2.0668 2.2553 2.0016 1.6543 2.5438 1.5120 1.7489 1.3277 1.3483 1.1249 1.2718 1.4440 1.5242 1.2703 1.4578 1.3641 1.2190 1.2297 1.4592 1.0645 1.0638 1.0719 1.0578 1.0468 1.0666 1.0868 1.0798 1.0949 1.0715 1.0823 1.0708 1.0349 1.0352 1.0823 1.0597 1.0656 1.0843 1.0911 1.1031 1.0992 1.0985 1.0999 1.1036 1.1012 1.0449 1.0975
irintensity: 0.5962 1.6060 2.4792 1.4864 1.3097 14.1360 23.0672 2.8167 16.8622 4.0701 12.3425 0.5751 4.2812 0.4087 6.0124 218.8171 6.5826 10.3031 3.7232 0.8753 2.1051 4.6172 1.7622 4.1786 1.5186 2.4063 10.1702 6.5867 10.1078 8.2804 18.9528 27.7412 1.5421 6.1008 16.1065 8.1237 35.5870 14.8923 21.0127 4.0676 7.6473 3.5966 16.2851 1.9999 6.4530 18.7044 11.4790 0.7200 24.2723 23.7923 3.0376 4.0318 1.1036 11.6309 4.6394 16.8174 0.9363 5.9789 1.7520 46.6476 91.5077 105.1060 99.9652 34.1177 25.3441 27.6268 47.3182 46.0571 16.7161 44.6022 5.0112 21.2624 74.1299 50.4259 35.0598 62.5309 0.8667 0.3689
temp: 298.150 k
press: 1.00000 atm
elementType: 7 7 6 6 6 6 6 6 6 6 1 1 1 1 1 1 1 1 1 1 1 1 1 1 1 1 1 1
symmnumber: 1
zpe: 665489.3 jmol-1
zpe.correction: 0.253471 hartree
zpe.thermalcorrener: 0.265592 hartree
zpe.thermalcorrenthalpy: 0.266537 hartree
zpe.thermalcorrgfe: 0.215343 hartree
zpe.sumelectzpe: -424.287295 hartree
zpe.sumelectthermal: -424.275174 hartree
zpe.sumelectthermalent: -424.274230 hartree
zpe.sumelectthermalfe: -424.325424 hartree
dipole: 0.1460 -1.5673 -0.2937
dipole: 1.6013
quadrupole: -58.8886 -65.6438 -63.5068
quadrupole: -4.4409 1.4024 0.0629
quadrupole: 3.7912 -2.9641 -0.8271 -4.4409 1.4024 0.0629
hfenergy: -424.5407668 hartree
pointgroup: C01 [X(C8H18N2)]
dipole: -0.0793444 0.6075891 -0.1464186 debye
polarizability: 111.7089448|0.1956025|99.5729325|0.9855311|0.0224539|84.9856233 unknown
InChI: InChI=1S/C8H18N2/c1-7-3-4-8(2)10(7)6-5-9/h7-8H,3-6,9H2,1-2H3
charge 0 multiplicity 1
28 atoms
N  0.044422 -0.167323 0.167488
N  -3.733759 -0.397887 -0.065179
C  0.431473 1.266257 0.325659
C  1.183799 -0.911119 -0.461148
C  1.916854 1.13116 0.738209
C  2.442134 -0.042253 -0.137687
C  -1.285755 -0.474653 -0.386065
C  0.247976 2.153479 -0.938342
C  1.282022 -2.352652 0.078397
C  -2.437941 -0.003352 0.524873
H  -0.160494 1.710823 1.149182
H  1.051484 -0.964474 -1.570911
H  1.974168 0.864063 1.80834
H  2.482952 2.06705 0.585184
H  2.900229 0.336682 -1.068926
H  3.211502 -0.633003 0.389853
H  -1.434267 -0.047554 -1.413791
H  -1.38153 -1.569906 -0.489994
H  0.85708 1.786576 -1.7852
H  -0.807854 2.183837 -1.265786
H  0.557631 3.192128 -0.718261
H  2.110702 -2.897693 -0.412268
H  1.461523 -2.334859 1.168253
H  0.350598 -2.919742 -0.104314
H  -2.327929 -0.503862 1.503878
H  -2.344513 1.094711 0.707977
H  -3.936527 0.049525 -0.964816
H  -4.528281 -0.343259 0.577994
