program: Gaussian 09
title: 000236772
version: EM64L-G09RevD.01
frameworkgroup: C1[X(C14H16O)]
method: RPBEPBE
basis: SDD
operation: Freq
keyword: #pfreq=noraman
keyword: PBEPBE/SDD
title: #p freq=noraman PBEPBE/SDD
converged: YES YES NO NO
title: Mulliken charges:
elementType: O C C C C C C C C C C C C C C H H H H H H H H H H H H H H H H
charge: -0.285987 -0.093921 -0.270931 0.128402 0.254526 -0.691168 -0.697745 0.435382 -0.389430 -0.374105 -0.457326 -0.423504 -0.239295 -0.238583 -0.239631 0.218321 0.209957 0.197646 0.212539 0.198993 0.243958 0.223783 0.213625 0.205557 0.248575 0.265123 0.235827 0.236224 0.221713 0.226230 0.225243
chargesum: 0.00000
title: Mulliken charges with hydrogens summed into heavy atoms:
elementType: O C C C C C C C C C C C C C C
charge: -0.285987 0.124401 0.136672 0.128402 0.254526 -0.035678 -0.054780 0.435382 -0.140855 -0.108982 -0.221499 -0.187280 -0.017582 -0.012353 -0.014388
polarizability: 2.08727085e+02 -1.32064313e+01 1.82864079e+02 3.40206989e+00 4.97161321e+00 8.16677214e+01
1716.lowfreq: -11.1228 -8.5562 -0.4607 -0.0005 0.0003 0.0007 37.5700 41.3424 77.6069
frequency: 37.5154 41.1324 77.6057 122.5909 151.4580 184.6250 194.5647 206.8391 231.3553 240.1451 263.4752 359.4947 390.2929 420.5271 427.0779 467.5930 472.2398 505.9658 533.4111 573.5560 608.2357 642.7754 716.3055 740.8748 781.7336 782.0718 806.8419 833.4640 849.0727 862.9463 891.0548 916.9987 921.2658 943.2404 961.2184 970.7963 972.3817 974.5876 994.0441 1022.3527 1061.3169 1086.3501 1136.8322 1146.9347 1150.0011 1170.3481 1185.1581 1189.5099 1229.1004 1235.7972 1241.7055 1268.0913 1296.9544 1344.0907 1363.9873 1377.8498 1380.1220 1398.7809 1404.2661 1426.9179 1439.3378 1451.8441 1464.4924 1468.5261 1479.1686 1482.1317 1489.5457 1516.9787 1583.4634 1596.1771 1634.8970 2940.9767 2972.0914 2976.3958 2988.4767 3010.8474 3062.7452 3070.9263 3078.9367 3094.3095 3120.5889 3126.8407 3134.9636 3148.6658 3154.2331 3170.7604 3173.2093
redmass: 3.5394 2.8988 3.7177 2.9234 3.4308 2.7560 1.2165 1.9173 2.8560 1.6540 4.2813 2.8655 2.8725 3.0806 2.1034 4.5373 3.2994 6.6000 5.4925 3.2512 6.7216 3.2248 6.1360 1.3192 1.6722 4.6323 1.9565 2.6105 4.5023 1.4573 1.6300 1.5747 1.2000 1.6060 1.3316 2.3402 2.0126 1.3878 1.3273 2.5522 2.9995 2.3419 2.0560 1.4284 1.7139 1.0789 1.2724 1.7460 1.7462 1.8059 1.5462 1.8059 1.3576 1.4068 1.5497 1.3779 1.6548 1.2942 2.8072 6.1743 2.4136 2.2941 1.0888 1.0465 1.1072 1.0509 1.0614 3.8610 6.8573 5.7776 6.9524 1.0552 1.0361 1.0387 1.0860 1.1034 1.0991 1.0986 1.0988 1.0992 1.0860 1.0859 1.0901 1.0946 1.0961 1.0954 1.0971
irintensity: 0.5446 0.0166 0.1233 1.0871 5.7297 0.6832 0.2747 1.0151 0.8254 1.0892 0.3968 0.3863 0.7041 5.9701 1.7677 2.3856 0.1076 0.5836 0.7289 10.5675 3.0203 0.9792 14.4029 1.4187 88.5486 6.5395 65.5149 2.4745 4.6860 0.0800 3.8521 3.4045 3.6028 12.0510 0.1410 12.1341 34.4543 6.3579 0.0112 26.0861 95.2272 62.0527 4.6783 6.0502 0.2045 2.2456 4.1900 22.4361 84.4725 38.9562 35.4149 36.3698 0.3625 2.2068 18.9647 19.9709 18.6167 29.2588 23.9224 29.2400 7.8494 43.3974 2.5295 1.3259 5.6505 13.3222 24.8128 26.3944 81.0839 3.9444 4.4984 35.3302 36.7035 29.5954 6.4897 43.2687 21.4934 65.8401 47.9439 36.2727 1.2526 1.6603 15.7067 32.7946 35.6020 24.3012 9.7699
temp: 298.150 k
press: 1.00000 atm
elementType: 8 6 6 6 6 6 6 6 6 6 6 6 6 6 6 1 1 1 1 1 1 1 1 1 1 1 1 1 1 1 1
symmnumber: 1
zpe: 681987.3 jmol-1
zpe.correction: 0.259755 hartree
zpe.thermalcorrener: 0.273660 hartree
zpe.thermalcorrenthalpy: 0.274604 hartree
zpe.thermalcorrgfe: 0.218579 hartree
zpe.sumelectzpe: -617.224930 hartree
zpe.sumelectthermal: -617.211026 hartree
zpe.sumelectthermalent: -617.210081 hartree
zpe.sumelectthermalfe: -617.266107 hartree
dipole: -1.6457 0.7388 -0.0380
dipole: 1.8043
quadrupole: -76.7009 -81.9552 -95.1189
quadrupole: -1.8072 1.0640 1.0730
quadrupole: 7.8908 2.6365 -10.5273 -1.8072 1.0640 1.0730
hfenergy: -617.4846857 hartree
pointgroup: C01 [X(C14H16O1)]
dipole: 0.6333311 -0.3016277 -0.1088431 debye
polarizability: 206.8805899|-12.2060046|181.6976076|-12.7577764|15.6424596|84.6806883 unknown
InChI: InChI=1S/C14H16O/c1-11(2)10-15-14-9-5-7-12-6-3-4-8-13(12)14/h3-9,11H,10H2,1-2H3
charge 0 multiplicity 1
31 atoms
O  1.321575 0.220583 -0.296286
C  3.732474 0.486736 -0.466917
C  2.576639 -0.525017 -0.500047
C  -1.062654 0.297381 -0.045673
C  0.121242 -0.5020 -0.259794
C  3.835782 1.179958 0.9101
C  5.051872 -0.229348 -0.841918
C  -2.346512 -0.368784 0.006388
C  0.030886 -1.891788 -0.415529
C  -0.999092 1.718469 0.115492
C  -2.413385 -1.793822 -0.155423
C  -3.522075 0.424684 0.220614
C  -1.2475 -2.53025 -0.361484
C  -2.164586 2.46233 0.323104
C  -3.436609 1.810455 0.376379
H  3.515979 1.256608 -1.234631
H  2.536704 -1.048451 -1.478339
H  2.69381 -1.280727 0.306319
H  4.62308 1.955663 0.899618
H  4.093214 0.44647 1.698933
H  2.879102 1.65642 1.18393
H  5.893233 0.486504 -0.838175
H  4.999809 -0.686315 -1.848082
H  5.290304 -1.028477 -0.113558
H  0.9234 -2.501561 -0.578823
H  -0.021313 2.206167 0.070856
H  -3.388771 -2.291461 -0.114731
H  -4.49558 -0.078596 0.260623
H  -1.298546 -3.617741 -0.485023
H  -2.106884 3.549585 0.445198
H  -4.343901 2.402821 0.53948
