program: Gaussian 09
title: 000236770
version: EM64L-G09RevD.01
frameworkgroup: C1[X(C21H12ClNO)]
method: RPBEPBE
basis: SDD
operation: Freq
keyword: #p
keyword: freq=noraman
keyword: PBEPBE/SDD
title: #p freq=noraman PBEPBE/SDD
converged: NO YES NO NO
title: Mulliken charges:
elementType: Cl O N C C C C C C C C C C C C C C C C C C C C C H H H H H H H H H H H H
charge: -0.046699 -0.260353 -0.024025 0.252040 0.239977 0.408616 0.466912 -0.072806 -0.414636 -0.389591 0.059685 -0.394345 -0.450726 -0.466944 0.344624 -0.255677 -0.258736 -0.244845 -0.244720 -0.347997 -0.367784 -0.209376 -0.207412 -0.116312 0.232135 0.229946 0.271507 0.282072 0.230771 0.229172 0.235536 0.234733 0.264208 0.274407 0.257607 0.259036
chargesum: 0.00000
title: Mulliken charges with hydrogens summed into heavy atoms:
elementType: Cl O N C C C C C C C C C C C C C C C C C C C C C
charge: -0.046699 -0.260353 -0.024025 0.252040 0.239977 0.408616 0.466912 -0.072806 -0.414636 -0.157456 0.059685 -0.164399 -0.179219 -0.184873 0.344624 -0.024906 -0.029564 -0.009309 -0.009987 -0.083789 -0.093377 0.048231 0.051624 -0.116312
polarizability: 4.76290846e+02 4.24697887e+00 3.10491152e+02 7.14795168e-03 3.04824574e-03 8.92236372e+01
1716.lowfreq: -6.3833 -0.0020 -0.0013 -0.0005 1.0444 2.4509 33.6494 41.3510 51.8029
frequency: 33.6391 41.3411 51.8029 89.6871 97.6229 103.7908 177.3946 177.6274 178.3128 198.5127 254.0605 282.7699 290.0173 300.9891 371.6896 398.1083 407.7071 409.5804 422.1781 436.1171 454.9677 461.1248 496.7067 524.9948 547.5817 575.8503 612.9455 618.4065 627.0893 665.7405 673.1060 673.9137 703.1943 720.5326 725.8080 744.5024 775.6734 777.6112 786.7088 830.4829 833.4739 843.5658 850.8526 886.5892 944.5722 949.4857 961.9835 967.0096 968.9891 974.2161 980.1761 989.4673 994.0375 998.4010 1004.7785 1022.1274 1042.0386 1043.5705 1072.4435 1094.3801 1111.8766 1119.5162 1166.9137 1177.4925 1178.8148 1184.0056 1227.6687 1249.4933 1290.5402 1292.7626 1296.7121 1312.1200 1367.9427 1378.5944 1384.0657 1405.6203 1413.2135 1426.0296 1447.9054 1451.3617 1464.3626 1520.6317 1528.0422 1545.3233 1573.2893 1579.1150 1592.5583 1608.7310 1630.6532 1634.8663 3130.2759 3132.9611 3143.7322 3147.1359 3155.6852 3157.5019 3158.2486 3161.4842 3168.6241 3171.8098 3175.1318 3179.0643
redmass: 9.2024 3.7747 7.9018 5.7302 4.3423 4.9857 7.7931 7.2756 7.2541 5.8197 5.7749 6.2331 6.0666 4.8918 6.0801 6.9580 2.9190 9.2693 8.0398 3.2942 5.8448 3.2107 3.2168 8.6651 3.7615 3.2095 7.0833 6.9993 7.3832 7.1239 6.2282 6.2295 3.4691 6.9754 3.7896 2.2009 6.4386 1.6233 1.7673 1.5262 1.2718 1.5385 13.6659 1.4442 8.6919 3.0544 1.5511 1.3777 1.3586 9.2161 1.3628 7.4641 1.3762 1.3675 3.9246 7.3448 1.9112 2.2416 2.7193 2.9554 1.4717 2.0427 1.7209 1.0852 1.0999 1.1206 4.3421 1.6064 1.9174 1.9448 1.3189 4.2442 5.6070 4.6256 5.5083 3.8547 3.1116 2.5817 2.5572 2.8184 2.8795 4.3392 4.5320 7.5414 7.6193 7.7825 6.5396 6.3334 7.0019 8.0390 1.0853 1.0853 1.0892 1.0895 1.0954 1.0887 1.0886 1.0941 1.1009 1.0989 1.0969 1.0980
irintensity: 0.1131 0.0000 0.0268 0.2986 0.0413 2.4932 0.5955 1.3371 0.0001 0.2924 0.0204 0.8849 0.0002 0.1161 1.5521 8.4603 0.0001 9.7444 5.3109 10.1037 0.0819 0.1182 18.0286 15.0015 2.3341 0.0365 4.0562 0.3268 0.0245 4.3834 14.8082 12.7204 1.6122 6.1222 8.3280 73.3935 1.0270 98.7816 4.2505 0.2669 4.8147 62.7372 16.1696 2.3115 19.4004 0.0008 0.0978 2.5918 1.9876 65.7938 0.2505 1.6172 0.0084 0.2798 10.9343 16.7335 6.1415 1.9738 64.7130 9.3826 4.4911 0.0428 0.8586 0.4426 0.0380 4.2498 1.9585 10.7157 1.4090 0.4160 1.1561 4.0544 0.9475 0.9863 4.2275 13.2561 5.2133 28.5115 18.7302 68.0032 81.6640 3.4965 6.0730 4.4350 0.7521 3.6095 3.6567 22.5282 5.4187 0.9354 0.9812 0.7569 14.0678 6.0989 1.6706 0.9755 3.0218 19.4466 40.5264 35.7456 3.8853 1.7541
temp: 298.150 k
press: 1.00000 atm
elementType: 17 8 7 6 6 6 6 6 6 6 6 6 6 6 6 6 6 6 6 6 6 6 6 6 1 1 1 1 1 1 1 1 1 1 1 1
symmnumber: 1
zpe: 697326.7 jmol-1
zpe.correction: 0.265598 hartree
zpe.thermalcorrener: 0.283164 hartree
zpe.thermalcorrenthalpy: 0.284108 hartree
zpe.thermalcorrgfe: 0.219021 hartree
zpe.sumelectzpe: -1395.913503 hartree
zpe.sumelectthermal: -1395.895937 hartree
zpe.sumelectthermalent: -1395.894993 hartree
zpe.sumelectthermalfe: -1395.960080 hartree
dipole: 2.6403 0.9340 0.0000
dipole: 2.8006
quadrupole: -135.5399 -125.0718 -152.3241
quadrupole: 0.7612 0.0005 0.0012
quadrupole: 2.1053 12.5735 -14.6788 0.7612 0.0005 0.0012
hfenergy: -1396.1791011 hartree
pointgroup: C01 [X(C21H12Cl1N1O1)]
dipole: 1.0332675 -0.3826482 -0.0000166 debye
polarizability: 476.1305926|-6.6769139|310.6514062|-0.0071025|0.0031528|89.2236372 unknown
InChI: InChI=1S/C21H12ClNO/c22-14-11-9-13(10-12-14)21-23-19-17-7-3-1-5-15(17)16-6-2-4-8-18(16)20(19)24-21/h1-12H
charge 0 multiplicity 1
36 atoms
Cl -7.619639 0.042365 0.000056
O  -0.814467 -1.056885 -0.00002
N  -0.732089 1.254868 -0.000043
C  2.963791 -0.842995 -0.000114
C  3.043328 0.631756 -0.000131
C  1.680302 -1.513132 -0.000078
C  1.841512 1.43481 -0.000113
C  0.537318 -0.660381 -0.000065
C  0.581674 0.736906 -0.000077
C  4.124994 -1.673075 -0.00013
C  -1.534817 0.191595 -0.000021
C  4.290752 1.327196 -0.000164
C  1.593579 -2.936409 -0.000059
C  1.911447 2.856459 -0.000127
C  -2.989453 0.133889 0.000004
C  4.030343 -3.073189 -0.00011
C  4.349218 2.728934 -0.000175
C  2.758478 -3.7124 -0.000074
C  3.154409 3.502232 -0.000156
C  -3.681703 -1.108321 -0.000138
C  -3.731596 1.34816 0.000169
C  -5.089751 -1.139495 -0.000123
C  -5.138313 1.324508 0.000185
C  -5.79974 0.07836 0.000038
H  5.120136 -1.219088 -0.000159
H  5.230471 0.767429 -0.000184
H  0.605434 -3.407097 -0.00003
H  0.975295 3.423117 -0.000115
H  4.943168 -3.678628 -0.000124
H  5.322815 3.23115 -0.000199
H  2.694283 -4.805509 -0.000058
H  3.209437 4.596013 -0.000164
H  -3.115744 -2.044386 -0.00026
H  -3.191715 2.299884 0.00028
H  -5.627237 -2.092208 -0.00024
H  -5.712622 2.255371 0.000316
