program: Gaussian 09
title: 000236754
version: EM64L-G09RevD.01
frameworkgroup: C1[X(C6H8Cl6N2S2)]
method: RPBEPBE
basis: SDD
operation: Freq
keyword: #p
keyword: freq=noraman
keyword: PBEPBE/SDD
title: #p freq=noraman PBEPBE/SDD
converged: YES YES NO NO
title: Mulliken charges:
elementType: Cl Cl Cl Cl Cl Cl S S N N C C C C C C H H H H H H H H
charge: 0.101078 0.078405 0.085693 0.101069 0.078383 0.085662 0.516438 0.516434 -0.511268 -0.511278 -0.300872 -0.315521 -0.300805 -0.315561 -0.628489 -0.628444 0.239227 0.241088 0.248071 0.246153 0.239243 0.241071 0.248050 0.246171
chargesum: 0.00000
title: Mulliken charges with hydrogens summed into heavy atoms:
elementType: Cl Cl Cl Cl Cl Cl S S N N C C C C C C
charge: 0.101078 0.078405 0.085693 0.101069 0.078383 0.085662 0.516438 0.516434 -0.511268 -0.511278 0.179443 0.178704 0.179509 0.178660 -0.628489 -0.628444
polarizability: 2.74670838e+02 -3.79554088e-03 1.46769042e+02 -5.79705160e+00 2.06358334e-02 1.42005306e+02
1716.lowfreq: -12.4174 -3.8312 -0.0016 -0.0015 -0.0015 3.9851 6.9670 20.0583 22.9198
frequency: 5.3187 20.0245 21.3390 30.4847 49.6050 95.4095 110.1523 113.7641 138.3534 155.8777 156.6329 177.8814 187.8651 232.0053 244.5038 252.4522 259.5054 262.1696 281.3837 295.5897 310.3897 326.5642 351.5703 351.7405 362.8925 380.5380 471.5134 518.2912 614.5892 633.7285 636.4306 637.9958 651.2511 660.9195 675.0242 675.1637 841.3139 910.7300 921.6078 960.1134 1050.5328 1050.6734 1064.0273 1086.7622 1143.1872 1170.7506 1218.0697 1242.4679 1262.8448 1278.4957 1330.6632 1348.5344 1350.5802 1353.8844 1464.6652 1465.8538 1480.1195 1482.0293 2969.1355 2978.7367 2980.6886 2988.5867 3057.9363 3060.8899 3080.2882 3080.5840
redmass: 9.9429 30.2078 11.5856 13.9207 19.0606 5.0553 4.6674 8.0560 17.2381 9.7787 4.1600 12.6933 12.1531 14.5452 30.4566 27.1849 16.6761 2.5507 5.0362 5.9036 18.6844 3.3653 7.4311 17.1372 23.9084 13.4489 3.0317 3.7537 2.8528 8.9775 12.4654 12.4862 6.0551 6.9710 10.9812 10.7020 1.5369 3.2386 2.0200 3.2249 2.3741 2.3450 2.1611 2.2079 4.0899 1.9806 1.8585 1.2276 1.4363 1.2191 1.2467 1.3026 1.3747 1.2796 1.0749 1.0815 1.0762 1.0781 1.0679 1.0690 1.0620 1.0633 1.0955 1.1027 1.0948 1.1008
irintensity: 0.9499 0.0718 0.0314 0.4253 0.2517 3.3492 1.7621 0.0504 0.3478 0.6709 12.0340 1.7466 9.4508 3.0765 0.0892 9.5648 0.2627 0.2984 1.2201 0.3555 12.8475 0.2137 1.3049 1.1841 57.9956 2.7703 2.9396 7.6325 18.9631 6.4913 15.0610 335.0584 195.3377 1.4132 270.6143 4.4515 0.2368 1.1840 0.1046 202.0069 7.4662 0.1067 2.5273 0.5382 23.7022 2.5928 13.9113 0.4599 39.8802 1.6279 0.4113 57.1983 0.0839 0.7253 9.2988 32.5372 0.3802 25.0919 34.7641 0.0048 16.9969 70.9494 21.1022 15.7548 5.9372 10.5366
temp: 298.150 k
press: 1.00000 atm
elementType: 17 17 17 17 17 17 16 16 7 7 6 6 6 6 6 6 1 1 1 1 1 1 1 1
symmnumber: 1
zpe: 370983.9 jmol-1
zpe.correction: 0.141300 hartree
zpe.thermalcorrener: 0.161361 hartree
zpe.thermalcorrenthalpy: 0.162305 hartree
zpe.thermalcorrgfe: 0.086701 hartree
zpe.sumelectzpe: -3898.068616 hartree
zpe.sumelectthermal: -3898.048555 hartree
zpe.sumelectthermalent: -3898.047611 hartree
zpe.sumelectthermalfe: -3898.123215 hartree
dipole: -0.0006 -0.7450 0.0000
dipole: 0.7450
quadrupole: -174.9403 -145.9995 -152.0449
quadrupole: -0.0081 -2.4380 -0.0076
quadrupole: -17.2788 11.6621 5.6167 -0.0081 -2.4380 -0.0076
hfenergy: -3898.2099161 hartree
pointgroup: C01 [X(C6H8Cl6N2S2)]
dipole: -0.0001446 -0.2931138 -0.0013394 debye
dipolederiv: -1.1827388 0.1204472 0.2149706 0.1535249 -0.1391931 -0.0292505 0.2980355 -0.0389738 -0.2363616 -0.2227129 -0.1938134 0.0980618 0.0601825 -0.7331628 0.3247674 -0.1190226 0.3288724 -0.3662009 -0.2248947 -0.004453 -0.0307983 -0.1958216 -0.5171499 -0.4012659 -0.3151355 -0.3480098 -0.5999293 -1.1843382 -0.1197718 0.2138365 -0.1520465 -0.1389678 0.0287114 0.2965317 0.0384298 -0.2354577 -0.2222427 0.1922557 0.0980887 -0.0615816 -0.7318314 -0.3268578 -0.1203293 -0.3305543 -0.3689943 -0.2234451 0.0030169 -0.0288807 0.1951965 -0.5202714 0.4015023 -0.3123677 0.3483326 -0.5969095 0.8021559 -0.1277337 0.0809139 -0.1154818 -0.1255016 -0.0497865 -0.0224811 -0.0857615 0.0605604 0.8022519 0.1273538 0.0819349 0.1158196 -0.1264476 0.0489012 -0.0213998 0.0839732 0.0615986 -0.7407796 0.1112221 -0.2149937 -0.0731389 -0.4018449 -0.021149 0.257879 0.0039728 -0.4118941 -0.7406546 -0.1098453 -0.2157343 0.0717598 -0.4018604 0.0207489 0.2583164 -0.0038761 -0.4118112 0.1412362 -0.1093375 0.0409223 -0.5209328 0.3639015 0.0779245 -0.0555313 0.1435795 0.3290732 0.3312655 0.1812636 0.1326808 0.6076713 0.2474461 0.0459484 0.0639488 -0.0464106 0.1656386 0.1405436 0.1090003 0.0416234 0.5209592 0.3658577 -0.0774454 -0.0516606 -0.143165 0.3272171 0.3313504 -0.1820844 0.1313737 -0.6080796 0.246885 -0.0452742 0.0596405 0.0471174 0.165714 1.167862 0.0923051 -0.2118911 0.1028313 1.3313989 0.106351 -0.1409572 0.1133651 1.1077844 1.1676268 -0.090556 -0.2128679 -0.100773 1.3333488 -0.1039278 -0.1418381 -0.1109181 1.1061447 0.024803 0.0129024 -0.0546021 0.1286983 0.015789 0.015207 0.0186258 -0.0764174 -0.1065315 -0.0051291 -0.0817302 0.0343876 0.0013519 -0.0606057 0.0320052 0.0487612 0.0784322 0.0344425 -0.0802883 -0.0780522 -0.1036858 -0.1172799 0.0416309 0.0110163 -0.0953159 -0.0113483 -0.0698644 -0.0109175 0.0931436 0.0140577 0.0198231 -0.023287 -0.0073925 0.0613192 0.0112899 0.0939424 0.0251422 -0.0124584 -0.0547056 -0.1287025 0.0153391 -0.0143504 0.0176288 0.0772839 -0.1059538 -0.0052212 0.0814664 0.0350201 -0.0017058 -0.0599057 -0.0326992 0.0488037 -0.0791496 0.033643 -0.080068 0.0786739 -0.1031479 0.1178941 0.0417309 -0.0102712 -0.0945218 0.0119575 -0.0697934 -0.0108067 -0.0932151 0.0134355 -0.0201685 -0.0232988 0.0065868 0.0610705 -0.0120219 0.0939428 unknown
polarizability: 274.9225457|0.0357253|146.7687594|0.384963|0.0435084|141.7538811 unknown
InChI: InChI=1S/C6H8Cl6N2S2/c7-5(8,9)15-13-1-2-14(4-3-13)16-6(10,11)12/h1-4H2
charge 0 multiplicity 1
24 atoms
Cl -5.733961 0.706312 0.513727
Cl -3.487565 2.075105 -1.059241
Cl -4.073436 -0.861605 -1.517158
Cl 5.73546 0.705175 -0.509178
Cl 3.491156 2.074102 1.066411
Cl 4.06784 -0.866104 1.513439
S  -2.895624 0.032847 1.294359
S  2.896374 0.042914 -1.296116
N  -1.279731 -0.013449 0.674628
N  1.280196 -0.008325 -0.677473
C  -0.769959 -1.218543 -0.028377
C  -0.434535 1.211466 0.63976
C  0.770705 -1.218532 0.016979
C  0.434396 1.215913 -0.634475
C  -4.029423 0.488391 -0.215395
C  4.029399 0.489102 0.21696
H  -1.111877 -1.248425 -1.082296
H  -1.153532 -2.120917 0.479765
H  0.219089 1.250021 1.533755
H  -1.081443 2.10416 0.644564
H  1.112594 -1.255875 1.070666
H  1.154416 -2.117193 -0.497604
H  -0.219218 1.260141 -1.528207
H  1.080882 2.108917 -0.633295
