program: Gaussian 09
title: 000236745
version: EM64L-G09RevD.01
frameworkgroup: C1[X(C13H16ClNO3)]
method: RPBEPBE
basis: SDD
operation: Freq
keyword: #p
keyword: freq=noraman
keyword: PBEPBE/SDD
title: #p freq=noraman PBEPBE/SDD
converged: YES YES NO NO
title: Mulliken charges:
elementType: Cl O O O N C C C C C C C C C C C C C H H H H H H H H H H H H H H H H
charge: -0.091257 -0.288294 -0.249848 -0.262407 -0.454880 -0.529971 -0.332972 0.492932 0.217564 -0.582979 0.237718 -0.449406 -0.335695 -0.335014 -0.339699 0.178398 -0.219653 -0.674467 0.237567 0.237779 0.255688 0.238083 0.310824 0.274850 0.258113 0.225782 0.309467 0.271296 0.270769 0.228928 0.228844 0.211924 0.230039 0.229976
chargesum: 0.00000
title: Mulliken charges with hydrogens summed into heavy atoms:
elementType: Cl O O O N C C C C C C C C C C C C C
charge: -0.091257 -0.288294 -0.249848 -0.262407 -0.144056 -0.054625 0.160799 0.492932 0.217564 -0.050016 0.237718 -0.223624 -0.026228 -0.063718 -0.068930 0.178398 0.238119 -0.002528
polarizability: 2.89243293e+02 3.24037242e+00 1.69351910e+02 6.39406282e+00 1.31694773e+00 8.99860690e+01
1716.lowfreq: -7.5450 -1.7008 -0.0018 -0.0017 -0.0016 2.1621 13.7426 24.3797 35.3874
frequency: 13.6884 24.1527 35.2611 39.3554 60.6566 68.2449 74.6458 97.5901 117.4444 126.0480 171.3039 202.4469 209.4991 247.0416 256.1161 261.3882 324.5781 331.8420 354.2711 394.6022 413.4931 424.4945 485.8674 512.5814 572.8524 590.2895 628.7858 639.5373 662.1263 680.7666 723.5538 760.3816 774.8183 797.6647 798.7536 831.5545 845.0482 850.8349 861.0091 883.5049 946.4627 975.8835 982.6231 1005.2242 1009.5750 1023.4928 1028.0829 1067.1584 1096.0413 1112.2993 1122.7510 1128.2045 1135.5757 1166.1361 1183.7515 1206.1255 1248.4148 1249.0800 1259.1152 1269.5685 1288.9323 1304.0614 1325.1294 1358.9812 1365.0737 1374.5646 1399.4748 1421.0427 1444.5093 1451.1758 1456.5818 1463.3191 1473.6696 1486.6300 1492.3669 1506.6041 1585.1282 1613.0037 1620.3849 1629.9005 2979.1719 2992.5363 2995.0970 3008.7004 3039.0715 3051.1823 3066.6382 3066.8143 3091.7358 3106.4744 3117.0209 3136.9015 3163.0627 3172.3085 3200.1353 3523.7171
redmass: 7.3476 3.6124 4.3932 3.3582 5.7107 4.9073 3.9892 4.5075 3.4100 4.1696 3.3812 4.5315 3.2520 1.3497 5.1467 3.0117 4.8412 4.8993 4.2399 5.1935 2.9678 3.3942 5.2318 2.9400 3.4361 4.3740 6.7977 5.7129 1.2045 4.1787 3.6450 4.2855 2.4193 3.1301 1.1421 3.3850 1.4039 3.7251 1.8291 1.5044 4.7514 2.2789 1.3631 3.3297 1.3333 2.2825 1.6435 5.2808 2.0709 2.2118 1.3388 1.4149 1.4660 1.7152 1.1581 1.6345 1.1921 2.1514 1.7009 1.6052 1.2440 1.3538 1.3562 1.4287 1.7671 3.4599 1.2721 4.5952 1.0841 1.1014 1.0948 1.0405 1.0607 1.0770 2.1200 2.9801 5.9669 9.3263 5.3287 5.6999 1.0614 1.0619 1.0357 1.0581 1.0936 1.0657 1.1065 1.0959 1.0985 1.1026 1.0900 1.1108 1.0947 1.0906 1.0956 1.0762
irintensity: 0.1875 0.2767 3.7026 0.9379 2.3368 6.4601 3.5169 6.2013 0.8126 1.1666 2.6423 6.2908 4.9355 0.7814 4.4361 0.3514 3.1524 19.2565 1.3859 2.7618 0.0037 18.1324 3.0968 18.4937 1.0457 26.6571 0.3883 5.7462 50.4849 32.3148 3.8769 12.5478 7.8645 11.2723 3.5846 9.0285 29.4196 3.8897 4.6408 54.4022 4.9338 15.5179 0.1046 24.6263 1.2997 34.2867 2.3434 426.1702 0.1056 3.2823 11.4103 13.9473 5.6387 21.5566 135.9020 89.3376 25.1133 229.6022 172.1282 40.3789 11.7223 43.2294 38.7595 7.0543 24.5459 143.2471 21.0609 25.3314 1.8040 8.5279 34.6695 12.1556 6.3978 8.8943 341.5406 291.2251 8.6797 376.0418 33.1286 83.9341 6.3870 15.2375 22.3837 23.7265 11.1037 9.6931 7.9415 39.3799 33.5558 45.3412 16.3388 17.4899 4.2884 1.0490 3.5998 14.3149
temp: 298.150 k
press: 1.00000 atm
elementType: 17 8 8 8 7 6 6 6 6 6 6 6 6 6 6 6 6 6 1 1 1 1 1 1 1 1 1 1 1 1 1 1 1 1
symmnumber: 1
zpe: 706602.8 jmol-1
zpe.correction: 0.269131 hartree
zpe.thermalcorrener: 0.287914 hartree
zpe.thermalcorrenthalpy: 0.288859 hartree
zpe.thermalcorrgfe: 0.217784 hartree
zpe.sumelectzpe: -1244.155365 hartree
zpe.sumelectthermal: -1244.136581 hartree
zpe.sumelectthermalent: -1244.135637 hartree
zpe.sumelectthermalfe: -1244.206711 hartree
dipole: -0.8975 -0.7651 -0.6288
dipole: 1.3365
quadrupole: -108.6640 -114.6449 -113.9964
quadrupole: -6.1466 4.6215 -1.8176
quadrupole: 3.7711 -2.2098 -1.5613 -6.1466 4.6215 -1.8176
hfenergy: -1244.4244955 hartree
pointgroup: C01 [X(C13H16Cl1N1O3)]
dipole: -0.364226 -0.2422609 -0.2917733 debye
polarizability: 288.9028041|-4.8386136|167.5310461|9.7975972|11.9172586|92.1474213 unknown
InChI: InChI=1S/C13H16ClNO3/c1-2-18-13(17)10-5-7-11(8-6-10)15-12(16)4-3-9-14/h5-8,15H,2-4,9H2,1H3
charge 0 multiplicity 1
34 atoms
Cl -7.253793 1.16174 0.417993
O  4.395521 -0.742408 0.086801
O  -2.540398 -1.591601 -0.544394
O  4.519142 1.564176 0.410635
N  -1.897607 0.645601 -0.221847
C  -4.284577 0.132816 -0.55455
C  -5.270935 -0.844775 0.119613
C  -0.483494 0.544633 -0.122295
C  -2.838933 -0.366043 -0.433835
C  -6.732792 -0.560934 -0.205456
C  2.346273 0.500544 0.094711
C  0.24202 1.750698 0.094313
C  0.216624 -0.688995 -0.229307
C  1.640236 1.727521 0.201802
C  1.619668 -0.698375 -0.120789
C  3.828529 0.530339 0.215565
C  5.883563 -0.803478 0.196315
C  6.278693 -2.266064 0.020098
H  -4.411439 1.147864 -0.134695
H  -4.523094 0.200567 -1.635989
H  -5.034346 -1.8703 -0.229226
H  -5.120904 -0.839974 1.214861
H  -2.275855 1.591861 -0.129728
H  -7.417938 -1.256364 0.301116
H  -6.934591 -0.538757 -1.287911
H  -0.2949 2.704364 0.178027
H  -0.344918 -1.609849 -0.392414
H  2.209144 2.64771 0.368743
H  2.166385 -1.641815 -0.202344
H  6.317067 -0.14964 -0.582141
H  6.176189 -0.400268 1.182837
H  7.376852 -2.367664 0.094288
H  5.818387 -2.896038 0.800393
H  5.961119 -2.644587 -0.966589
