program: Gaussian 09
title: 000236739
version: EM64L-G09RevD.01
frameworkgroup: C1[X(C10H11Cl2NO)]
method: RPBEPBE
basis: SDD
operation: Freq
keyword: #p
keyword: freq=noraman
keyword: PBEPBE/SDD
title: #p freq=noraman PBEPBE/SDD
converged: NO YES NO NO
title: Mulliken charges:
elementType: Cl Cl O N C C C C C C C C C C H H H H H H H H H H H
charge: -0.063323 -0.071581 -0.254646 -0.457225 0.314402 0.299480 -0.507619 -0.329243 0.214315 -0.364182 -0.842480 -0.229449 -0.111185 -0.559424 0.338567 0.256319 0.256322 0.312908 0.258032 0.252429 0.232071 0.232079 0.257120 0.283160 0.283152
chargesum: 0.00000
title: Mulliken charges with hydrogens summed into heavy atoms:
elementType: Cl Cl O N C C C C C C C C C C
charge: -0.063323 -0.071581 -0.254646 -0.118658 0.314402 0.299480 0.005023 -0.016334 0.214315 -0.106149 -0.125902 0.027672 -0.111185 0.006888
polarizability: 2.27714885e+02 -7.08979858e+00 1.32914137e+02 -3.03606534e-03 -2.43000794e-03 6.51886528e+01
1716.lowfreq: -42.0957 -5.7075 -2.8250 -0.0020 0.0013 0.0019 3.6649 28.0805 56.2472
frequency: -41.9635 28.0743 56.2333 61.7253 84.2324 149.7446 158.1821 181.4306 204.9229 206.0105 234.3196 296.7155 316.4600 349.7471 407.5872 445.3062 452.6679 525.6547 540.2139 573.1341 605.6669 636.9085 664.0128 721.9638 740.2243 786.6284 795.1862 842.3204 856.9096 871.9175 932.1274 978.9729 987.7848 989.6678 1041.3911 1077.2342 1089.8365 1116.4031 1121.8574 1169.5339 1194.4970 1248.7643 1264.7327 1273.8124 1289.1255 1326.8905 1371.2213 1397.7811 1400.6238 1445.4283 1454.6478 1459.3773 1481.8177 1485.0729 1511.0156 1588.4434 1610.2821 1621.5126 2958.6295 2991.1179 3028.4010 3047.2033 3086.0211 3094.2633 3154.9626 3167.9579 3171.2066 3195.8366 3530.4485
redmass: 1.9508 12.5184 6.0235 9.9632 4.3408 3.4824 10.6534 2.0027 1.4499 7.8806 4.3288 9.3840 6.1002 4.9365 5.7380 3.0330 4.1632 5.2560 3.2028 2.7371 7.7991 1.2332 7.3198 3.8700 5.1417 1.2732 4.7364 1.3668 6.2283 1.3393 6.1313 1.3178 1.5406 1.5445 1.5153 4.0831 2.0178 2.0024 1.1618 2.0344 1.7834 1.3542 1.4975 1.1493 2.0618 1.6117 6.4327 1.2688 3.7862 1.3695 1.3665 1.0955 1.0442 1.5378 1.9327 6.5256 7.1641 4.0769 1.0401 1.0595 1.0980 1.1012 1.0573 1.0948 1.0928 1.0913 1.1117 1.0954 1.0757
irintensity: 0.7576 0.3832 4.2611 1.0134 7.9222 0.3364 5.5551 3.0959 0.2010 2.9602 2.6188 4.9529 13.2926 0.5618 11.3699 9.2441 6.4620 0.3749 14.1005 3.3648 14.2846 52.9876 59.2986 4.3892 19.8607 12.2679 5.0835 51.0967 29.0745 16.5399 36.9496 3.3070 6.2948 0.5958 6.9476 0.6819 19.1599 1.6352 0.3086 45.9148 35.9085 0.8060 2.7120 0.8214 39.7140 39.0277 106.8203 20.9954 57.8628 80.0062 24.7997 8.5908 16.0939 172.0216 375.0426 44.9185 15.5899 111.3649 29.0406 11.9478 19.5585 7.2331 7.4328 14.7244 3.3360 1.4613 8.2047 8.5619 24.6096
temp: 298.150 k
press: 1.00000 atm
elementType: 17 17 8 7 6 6 6 6 6 6 6 6 6 6 1 1 1 1 1 1 1 1 1 1 1
symmnumber: 1
zpe: 497347.5 jmol-1
zpe.correction: 0.189430 hartree
zpe.thermalcorrener: 0.203051 hartree
zpe.thermalcorrenthalpy: 0.203995 hartree
zpe.thermalcorrgfe: 0.147102 hartree
zpe.sumelectzpe: -1436.749309 hartree
zpe.sumelectthermal: -1436.735688 hartree
zpe.sumelectthermalent: -1436.734744 hartree
zpe.sumelectthermalfe: -1436.791637 hartree
dipole: -0.0031 3.6916 -0.0009
dipole: 3.6916
quadrupole: -124.0860 -89.5756 -98.0292
quadrupole: 1.2707 0.0006 0.0023
quadrupole: -20.1890 14.3213 5.8677 1.2707 0.0006 0.0023
hfenergy: -1436.9387391 hartree
pointgroup: C01 [X(C10H11Cl2N1O1)]
dipole: 0.0624342 -1.4510457 -0.0015641 debye
dipolederiv: -0.9388262 -0.1620803 0.0008685 -0.1603677 -0.1644538 0.0000784 0.0008787 0.000087 -0.0729341 -0.6626899 -0.0676151 0.0005869 -0.1832834 -0.226974 0.0002054 0.000479 0.0000479 -0.1817211 -0.7955073 -0.041725 0.0005936 0.6806337 -0.8899466 -0.0012412 0.0013138 -0.0005169 -0.3242822 -1.9333319 0.2488731 0.0023365 0.4589161 -0.4321123 -0.0007543 0.0024482 -0.0004816 -0.3001377 1.1095234 0.0617523 -0.0013087 0.2930813 -0.0964824 -0.0005261 -0.0011496 -0.000242 0.0627673 -0.1189261 0.0567204 0.0001543 0.095347 0.2411962 0.0002961 0.0001808 0.0003073 -0.0657257 -0.3641659 -0.054693 0.0006031 -0.3604925 -0.1567985 0.0002185 0.0005379 -0.0001852 0.115932 -0.1462213 0.0286428 0.0000457 -0.0784736 -0.0269811 0.0002631 0.0000016 0.0000997 -0.1487781 1.8426675 -0.2010964 -0.0023102 -1.0089275 1.1472768 0.0019954 -0.0033406 0.0011297 0.1706104 -0.246521 -0.1165122 -0.0000019 -0.1338627 -0.0679242 0.0002245 -0.0000516 0.000222 -0.1214114 -0.019293 -0.0522921 0.0000532 -0.0427274 -0.0747481 -0.0001887 0.0000516 -0.0001356 0.0850715 -0.2956385 -0.0475779 0.0001513 0.028136 0.0267706 0.0001537 0.0002939 0.0002327 -0.1145651 1.2352097 0.2513291 -0.0012991 0.2152422 0.1269573 -0.0000156 -0.0013352 -0.0000642 -0.0677329 0.8484954 0.1824033 -0.0007128 0.2312196 0.2489824 -0.0002574 -0.0006472 -0.0001884 0.1949566 0.2013417 -0.0389651 0.0000018 -0.0884236 0.1419242 0.0000336 0.0000115 0.0000217 0.2722446 0.0133148 0.0043251 -0.0221256 0.036476 0.0207159 0.0861274 -0.0189192 0.0923271 -0.0118976 0.0135185 0.0040149 0.0220317 0.036171 0.0210609 -0.0861661 0.0188819 -0.0922745 -0.0123733 0.1571162 0.0552613 0.0001059 0.0220015 0.0769686 -0.0001702 0.0000811 -0.0001841 0.1775749 0.0340649 0.0665476 0.0002456 0.0831955 0.0006237 -0.0003216 0.0002767 -0.0003041 0.1581364 -0.0525593 0.165078 0.0005087 0.0488675 0.0257104 -0.0002189 0.0003352 -0.0003985 0.1184122 0.0276295 -0.0917445 0.1160931 -0.045399 0.0206933 0.0036963 0.1092373 0.0543256 -0.0394144 0.0269581 -0.0915495 -0.1165463 -0.045093 0.0209173 -0.0033474 -0.1095419 -0.0538529 -0.038873 0.0721 -0.0446674 0.0000555 -0.0530315 -0.0217607 -0.0001775 0.0000267 -0.0001823 0.1636578 -0.0041174 -0.0571218 0.007916 -0.0144961 0.0190513 0.0707773 -0.0073127 0.072344 -0.0096119 -0.004142 -0.0573077 -0.0080469 -0.0147095 0.019333 -0.0706847 0.0072623 -0.0721345 -0.009905 unknown
polarizability: 226.9117052|11.2135168|133.7169875|-0.1923242|0.0691513|65.1889818 unknown
InChI: InChI=1S/C10H11Cl2NO/c1-7-6-8(12)2-3-9(7)13-10(14)4-5-11/h2-3,6,13H,4-5H2,1H3
charge 0 multiplicity 1
25 atoms
Cl 5.149083 0.797897 -0.002158
Cl -6.010295 -0.406453 0.010919
O  -1.821216 1.605767 0.006991
N  -0.768207 -0.500706 0.003778
C  0.615383 -0.155769 0.002345
C  1.563655 -1.228316 -0.000329
C  -3.221341 -0.417786 0.007016
C  1.05706 1.193483 0.003537
C  -1.880773 0.339478 0.005775
C  2.941354 -0.913645 -0.001659
C  1.117365 -2.681586 -0.001789
C  2.436381 1.488104 0.00215
C  3.360411 0.429867 -0.000398
C  -4.392878 0.566571 0.009645
H  -0.971644 -1.502772 0.003279
H  -3.284767 -1.073869 0.896679
H  -3.287297 -1.072124 -0.883743
H  0.319355 1.997273 0.005493
H  3.682306 -1.719093 -0.003702
H  1.988536 -3.355967 -0.004191
H  0.516908 -2.934961 0.895168
H  0.514054 -2.932227 -0.897585
H  2.77687 2.52729 0.003074
H  -4.414501 1.196172 -0.88935
H  -4.412004 1.194374 0.909955
