program: Gaussian 09
title: 000236734
version: EM64L-G09RevD.01
frameworkgroup: C1[X(C12H14ClNO3)]
method: RPBEPBE
basis: SDD
operation: Freq
keyword: #p
keyword: freq=noraman
keyword: PBEPBE/SDD
title: #p freq=noraman PBEPBE/SDD
converged: YES YES NO NO
title: Mulliken charges:
elementType: Cl O O O N C C C C C C C C C C C C H H H H H H H H H H H H H H
charge: -0.077257 -0.277691 -0.259500 -0.323560 -0.463522 0.339002 0.016828 -0.340810 -0.489771 -0.308826 0.196253 -0.214440 0.236468 -0.246580 -0.560995 -0.221712 -0.671697 0.384140 0.260227 0.260662 0.315150 0.272288 0.234254 0.234998 0.280324 0.279869 0.232945 0.233074 0.216292 0.231804 0.231785
chargesum: 0.00000
title: Mulliken charges with hydrogens summed into heavy atoms:
elementType: Cl O O O N C C C C C C C C C C C C
charge: -0.077257 -0.277691 -0.259500 -0.323560 -0.079382 0.339002 0.016828 -0.025660 0.031117 -0.036538 0.196253 0.019813 0.236468 -0.011582 -0.000801 0.244307 0.008184
polarizability: 2.25554173e+02 -4.91979810e+00 1.94475173e+02 8.92831506e-02 -8.67830360e-03 7.85936761e+01
1716.lowfreq: -20.3617 -2.3259 -0.0013 -0.0010 0.0024 4.0790 7.8522 26.7566 39.9560
frequency: -19.2946 26.6844 39.8128 51.2185 64.0532 94.1958 102.0699 111.1883 119.2563 168.7512 185.3335 196.4211 240.8144 280.3298 280.6711 293.7607 339.7828 378.5865 405.5493 435.1639 496.3340 520.7682 562.5837 577.7666 645.7283 666.1464 681.5287 742.7987 760.9541 782.8721 787.7656 798.5262 800.3844 818.8668 855.6294 904.7740 929.3407 934.7139 980.7019 988.1835 1010.7502 1017.5993 1041.8713 1058.3863 1083.0934 1113.2821 1122.2790 1133.0816 1135.7236 1176.2804 1182.0945 1235.5460 1248.1716 1249.2858 1265.5136 1271.9947 1305.5066 1336.4914 1359.5689 1385.5152 1402.3813 1437.1784 1448.0567 1458.3409 1458.9919 1462.9251 1472.6140 1485.7790 1512.5285 1569.1268 1585.0472 1618.8293 1644.5970 2998.0070 2998.5765 3014.2795 3053.2862 3073.5623 3084.6533 3094.8901 3109.9813 3138.6592 3159.1534 3169.3280 3181.6786 3194.4112 3210.3270
redmass: 2.0735 3.0638 5.6594 7.4187 3.9843 3.0498 3.8498 4.3527 5.0014 3.6219 5.7142 8.2381 1.3271 6.9829 4.5544 5.3232 5.6097 4.4600 7.3775 3.6780 5.9805 3.2039 7.6639 2.7610 7.1583 7.3702 5.1177 5.1272 2.7492 1.3221 1.5256 1.1384 5.4494 4.7823 5.1014 1.3781 1.1182 6.1343 1.3671 1.5346 1.3166 2.3590 2.4370 5.0207 3.7343 2.2377 1.1781 1.9361 1.4617 1.1446 1.8038 2.2851 1.4053 1.1330 1.9164 1.1475 2.0187 1.7194 1.5251 6.7926 1.2812 2.5242 1.2682 1.4620 1.4155 1.0403 1.0624 1.0769 3.3397 5.9859 5.9323 6.8276 2.3132 1.0360 1.0602 1.0582 1.1007 1.1066 1.0572 1.0985 1.1029 1.0875 1.0925 1.1116 1.0963 1.0955 1.0824
irintensity: 0.2612 0.0253 0.0011 0.1590 0.2238 0.1991 16.4750 0.0299 0.1267 0.8689 18.6804 1.0266 1.0292 6.9602 1.3309 10.8059 0.0070 13.5998 4.9941 0.7488 10.7855 9.0011 17.8927 1.6172 40.2113 18.5373 18.9577 12.2619 26.8309 0.8053 50.2444 12.0642 2.5427 4.3076 17.7791 2.0130 85.9457 28.2276 3.7045 1.8396 3.2750 18.6390 33.1597 212.9838 11.8626 3.8506 0.9276 104.2784 5.8305 24.3182 56.7903 397.6672 21.3745 0.0307 266.6476 0.3976 100.2605 84.9114 27.7242 47.6876 19.0065 30.3472 19.6842 6.8830 35.3326 12.9086 6.9675 31.9036 586.7538 23.0991 411.1262 116.7466 12.1136 22.6133 10.4483 16.3595 5.0145 5.9025 8.2227 26.8897 42.1723 7.3265 14.9599 9.2060 7.1621 11.8922 274.1530
temp: 298.150 k
press: 1.00000 atm
elementType: 17 8 8 8 7 6 6 6 6 6 6 6 6 6 6 6 6 1 1 1 1 1 1 1 1 1 1 1 1 1 1
symmnumber: 1
zpe: 632939.6 jmol-1
zpe.correction: 0.241074 hartree
zpe.thermalcorrener: 0.257539 hartree
zpe.thermalcorrenthalpy: 0.258483 hartree
zpe.thermalcorrgfe: 0.194514 hartree
zpe.sumelectzpe: -1204.936613 hartree
zpe.sumelectthermal: -1204.920148 hartree
zpe.sumelectthermalent: -1204.919203 hartree
zpe.sumelectthermalfe: -1204.983173 hartree
dipole: -5.5403 -0.7094 -0.0020
dipole: 5.5855
quadrupole: -109.4441 -101.0364 -107.5708
quadrupole: 7.6092 -0.0032 -0.0084
quadrupole: -3.4270 4.9807 -1.5537 7.6092 -0.0032 -0.0084
hfenergy: -1205.1776867 hartree
pointgroup: C01[X(C12H14Cl1N1O3)]
dipole: -2.1944196 -0.0935182 0.0696742 debye
polarizability: 224.3501125|-7.4409485|195.5222602|-4.691136|1.0788244|78.7506492 unknown
InChI: InChI=1S/C12H14ClNO3/c1-2-17-12(16)9-5-3-4-6-10(9)14-11(15)7-8-13/h3-6,14H,2,7-8H2,1H3
charge 0 multiplicity 1
31 atoms
Cl 5.714532 -2.377415 -0.134391
O  -3.001798 -1.161901 0.155787
O  3.016575 1.404536 -0.015811
O  -0.785127 -1.833875 0.080001
N  1.078682 0.056016 0.035617
C  0.040809 1.014183 0.075401
C  -1.325961 0.554473 0.114575
C  0.299106 2.41405 0.078195
C  3.263907 -1.039984 -0.039248
C  -2.380884 1.507583 0.154895
C  2.455313 0.266979 -0.005614
C  -0.768179 3.329797 0.118677
C  -1.643151 -0.892455 0.113417
C  -2.113454 2.886386 0.157251
C  4.763392 -0.743662 -0.095173
C  -3.391472 -2.608073 0.158399
C  -4.914123 -2.648973 0.213436
H  0.727873 -0.924027 0.03837
H  2.963688 -1.644563 -0.916443
H  3.030811 -1.647576 0.856094
H  1.335715 2.752821 0.048141
H  -3.408719 1.136924 0.18424
H  -0.546172 4.402812 0.120063
H  -2.935809 3.607831 0.188523
H  5.120551 -0.205603 0.792585
H  5.053253 -0.202165 -1.005143
H  -2.984121 -3.075624 -0.755822
H  -2.918982 -3.09007 1.032897
H  -5.256592 -3.699691 0.216991
H  -5.290618 -2.158965 1.127366
H  -5.355743 -2.143771 -0.662277
