program: Gaussian 09
title: 000236732
version: EM64L-G09RevD.01
frameworkgroup: C1[X(C14H18ClNO3)]
method: RPBEPBE
basis: SDD
operation: Freq
keyword: #p
keyword: freq=noraman
keyword: PBEPBE/SDD
title: #p freq=noraman PBEPBE/SDD
converged: NO YES NO NO
title: Mulliken charges:
elementType: Cl O O O N C C C C C C C C C C C C C C H H H H H H H H H H H H H H H H H H
charge: -0.070284 -0.286774 -0.256042 -0.248384 -0.448451 -0.351796 -0.347583 -0.293278 -0.688511 0.235804 0.493362 0.177929 -0.351986 -0.322019 -0.344701 -0.443018 -0.505325 0.214145 -0.558702 0.230533 0.202170 0.203122 0.192012 0.228280 0.217344 0.216294 0.210388 0.218092 0.271583 0.272569 0.310717 0.223185 0.315846 0.258092 0.258353 0.283481 0.283554
chargesum: 0.00000
title: Mulliken charges with hydrogens summed into heavy atoms:
elementType: Cl O O O N C C C C C C C C C C C C C C
charge: -0.070284 -0.286774 -0.256042 -0.248384 -0.132605 0.080907 0.047552 0.152346 -0.043738 0.235804 0.493362 0.177929 -0.080403 -0.049450 -0.033984 -0.219834 0.011120 0.214145 0.008333
polarizability: 3.21710824e+02 5.87248341e+00 1.60136029e+02 -9.38764380e+00 7.24318022e+00 1.03695842e+02
1716.lowfreq: -33.8789 -9.0016 -4.5186 -0.6006 -0.0005 0.0012 0.0017 12.3229 25.8528
frequency: -33.3983 9.8788 25.7424 35.6107 47.7617 59.4951 65.2546 80.9899 88.1483 108.3523 131.1154 144.8970 152.2763 199.2915 225.0585 236.1109 267.6868 302.3919 312.6780 327.3134 366.6221 405.9874 413.8174 441.9538 501.1758 511.5457 570.6677 595.0655 629.6753 655.9020 665.7843 679.7249 740.2600 744.1306 750.7683 760.0281 785.4686 809.7470 830.9419 840.7763 887.6749 895.5447 911.3993 930.2551 940.5943 976.1840 989.4864 1004.5615 1013.2381 1029.1204 1057.7248 1073.7929 1079.5147 1115.4591 1121.5342 1125.4100 1162.1554 1164.6939 1186.0694 1226.7134 1247.4930 1251.0502 1264.8597 1271.7257 1272.1103 1289.9748 1290.4547 1305.6598 1328.1619 1345.9230 1369.5832 1373.6973 1391.9124 1419.3915 1449.9409 1452.1289 1458.5457 1471.4906 1476.3549 1477.7474 1488.8560 1493.3854 1510.5113 1584.0086 1618.0745 1621.0884 1629.9087 2968.1620 2976.2669 2990.0923 2992.2193 3013.4077 3020.3152 3045.5234 3052.8130 3073.6361 3076.4381 3084.9078 3098.9230 3117.2588 3158.4742 3169.9184 3180.1141 3200.5806 3514.2099
redmass: 1.9983 5.2297 4.8086 7.3333 2.9587 6.5001 2.3067 4.9240 4.4571 3.0206 3.5704 4.7977 8.2296 3.8997 1.2567 3.8377 5.0096 4.5299 5.3615 7.2889 4.7139 3.1315 2.9793 5.8921 4.4908 3.5001 2.7139 7.5460 7.1026 1.1942 6.5576 4.2398 1.9375 1.8223 2.8166 4.4015 1.2762 1.3714 5.0684 1.4191 1.4780 2.2853 3.8402 6.3310 1.2006 1.3684 1.5421 3.5108 1.3321 3.5933 4.5430 2.4473 3.9102 2.4716 1.1675 1.3635 2.0069 1.8484 1.1652 1.3231 1.4391 2.4336 2.2746 1.2983 1.1499 1.0632 1.1600 1.3922 1.6119 1.4528 1.4948 3.8270 1.2142 4.4820 1.1047 1.1022 1.0949 1.0683 1.0440 1.0610 1.0877 2.1145 2.8208 6.2719 4.8901 9.7215 5.6033 1.0587 1.0364 1.0597 1.0605 1.0992 1.0575 1.1009 1.1027 1.1010 1.0996 1.0572 1.1084 1.0903 1.0911 1.1117 1.0943 1.0951 1.0763
irintensity: 0.3048 0.0035 1.3082 2.1491 0.5840 0.7704 0.4789 1.3820 8.9796 1.1681 0.5543 0.8704 3.1581 1.8435 0.5673 8.8621 0.2844 29.7719 5.6270 1.0846 1.6571 4.7810 0.0364 8.8691 10.1108 8.6326 1.7336 20.8826 7.9989 53.4212 45.1624 33.2310 19.4897 14.0208 0.6705 13.3334 14.3054 1.3343 2.8562 31.7227 51.2910 19.1500 8.7824 24.3680 0.4150 0.0210 0.7423 54.4882 0.6916 6.2461 381.2853 5.7879 6.6896 12.7022 0.4957 20.3738 131.9965 2.8191 122.5313 10.1090 39.1180 240.4651 137.4655 32.2921 0.7351 2.4641 3.1725 37.3077 34.3308 7.0568 26.6520 286.7693 10.7304 43.3090 15.4924 24.5233 9.9496 0.3669 12.2532 3.9968 18.6918 92.1289 360.8985 129.9906 163.8716 179.2788 88.7475 34.5174 33.3899 12.9663 20.2013 9.7365 56.8981 6.5337 5.7224 61.0008 54.8248 7.3732 34.5874 19.2048 1.4220 8.0056 1.9820 3.5030 14.5972
temp: 298.150 k
press: 1.00000 atm
elementType: 17 8 8 8 7 6 6 6 6 6 6 6 6 6 6 6 6 6 6 1 1 1 1 1 1 1 1 1 1 1 1 1 1 1 1 1 1
symmnumber: 1
zpe: 779358.2 jmol-1
zpe.correction: 0.296842 hartree
zpe.thermalcorrener: 0.316352 hartree
zpe.thermalcorrenthalpy: 0.317296 hartree
zpe.thermalcorrgfe: 0.244475 hartree
zpe.sumelectzpe: -1283.375047 hartree
zpe.sumelectthermal: -1283.355537 hartree
zpe.sumelectthermalent: -1283.354593 hartree
zpe.sumelectthermalfe: -1283.427414 hartree
dipole: 1.6447 -4.4514 -0.4655
dipole: 4.7683
quadrupole: -128.5634 -119.9766 -120.7058
quadrupole: -1.1615 2.1734 1.7932
quadrupole: -5.4814 3.1053 2.3761 -1.1615 2.1734 1.7932
hfenergy: -1283.6718889 hartree
pointgroup: C01 [X(C14H18Cl1N1O3)]
dipole: 0.661839 1.2383835 1.244081 debye
polarizability: 321.5000806|-12.3009813|130.880553|3.5015333|29.095355|133.1620614 unknown
InChI: InChI=1S/C14H18ClNO3/c1-2-3-10-19-14(18)11-4-6-12(7-5-11)16-13(17)8-9-15/h4-7,16H,2-3,8-10H2,1H3
charge 0 multiplicity 1
37 atoms
Cl -8.270639 0.891301 -0.018919
O  3.321021 0.057468 0.925881
O  3.018877 -1.4996 -0.790576
O  -4.089632 -0.805134 -1.159612
N  -3.060742 0.556848 0.459479
C  5.464929 0.704809 -0.18203
C  7.003001 0.535475 -0.171875
C  4.792327 -0.188672 0.868902
C  7.697857 1.426713 -1.223815
C  1.091286 -0.33604 0.147704
C  -1.685958 0.223563 0.314991
C  2.536507 -0.66726 0.019239
C  0.166535 -0.996791 -0.700822
C  0.611397 0.614576 1.086397
C  -1.212238 -0.729362 -0.628863
C  -0.762516 0.890518 1.168908
C  -5.499418 0.67861 0.207537
C  -4.163511 0.061275 -0.240502
C  -6.659774 0.098462 -0.604175
H  5.069419 0.448598 -1.182744
H  5.204596 1.762732 0.017128
H  7.258202 -0.526636 -0.362129
H  7.39584 0.77815 0.836728
H  4.963293 -1.257621 0.646906
H  5.138106 0.05002 1.888852
H  7.347581 1.180601 -2.24352
H  7.481964 2.496459 -1.043181
H  8.794893 1.294181 -1.201456
H  0.550523 -1.727392 -1.420342
H  1.322104 1.125114 1.741227
H  -1.922255 -1.238646 -1.281688
H  -1.125777 1.626395 1.897971
H  -3.265251 1.258076 1.176865
H  -5.469537 1.77833 0.080943
H  -5.663561 0.483583 1.285219
H  -6.57901 0.324913 -1.675334
H  -6.778838 -0.982714 -0.455591
