program: Gaussian 09
title: 000236731
version: EM64L-G09RevD.01
frameworkgroup: C1[X(C13H16ClNO3)]
method: RPBEPBE
basis: SDD
operation: Freq
keyword: #p
keyword: freq=noraman
keyword: PBEPBE/SDD
title: #p freq=noraman PBEPBE/SDD
converged: YES YES NO NO
title: Mulliken charges:
elementType: Cl O O O N C C C C C C C C C C C C C H H H H H H H H H H H H H H H H
charge: -0.071366 -0.286734 -0.258045 -0.242077 -0.433945 -0.370159 -0.344533 -0.254867 -0.687325 0.234771 0.495375 0.177093 -0.331470 -0.341059 -0.443410 -0.334130 0.250297 -0.669781 0.208149 0.207894 0.197448 0.197128 0.223699 0.225392 0.212141 0.212033 0.218883 0.272590 0.272091 0.232131 0.306596 0.324745 0.300231 0.300214
chargesum: 0.00000
title: Mulliken charges with hydrogens summed into heavy atoms:
elementType: Cl O O O N C C C C C C C C C C C C C
charge: -0.071366 -0.286734 -0.258045 -0.242077 -0.109200 0.045885 0.050043 0.194224 -0.044269 0.234771 0.495375 0.177093 -0.058880 -0.068968 -0.211279 -0.027534 0.250297 -0.069337
polarizability: 2.85901765e+02 1.13650844e+01 1.75963145e+02 -7.13161050e-01 1.02823023e+00 8.78216562e+01
1716.lowfreq: -1.6382 -0.0015 -0.0012 -0.0010 3.4685 8.0722 17.9902 37.7376 39.4740
frequency: 17.5179 37.6795 39.3598 46.7754 63.6080 68.5830 83.9082 89.2457 110.0245 128.8029 135.3484 184.3866 194.8173 232.5054 236.4789 255.7506 323.0080 341.6207 365.9012 396.9419 413.8617 418.4758 506.6228 508.6556 520.6932 569.3475 629.3562 678.0664 680.9765 681.6428 738.4986 739.5409 765.0675 793.6686 798.1971 847.2986 850.6218 881.5457 898.5384 905.6847 917.0281 930.7678 942.5367 986.3744 1007.2419 1007.7705 1039.4734 1066.9832 1083.0084 1123.0656 1125.1914 1147.8758 1152.1324 1184.1037 1208.8673 1212.4620 1247.5470 1257.7197 1268.4949 1271.0497 1274.3527 1285.5880 1310.9218 1345.2520 1375.2208 1381.5478 1393.9877 1418.7895 1422.9304 1468.8450 1472.3687 1478.9058 1480.7693 1490.3768 1503.8684 1523.1443 1591.3355 1605.2016 1616.6169 1626.6583 2970.6017 2976.8035 2991.2056 3001.1853 3013.7066 3044.3610 3070.2460 3070.2636 3076.9927 3078.4217 3123.2169 3152.3503 3164.8132 3172.2492 3197.3854 3452.4258
redmass: 7.1920 4.0422 4.4262 2.7130 3.0040 3.4964 3.8358 8.5914 2.2515 3.5553 5.9557 3.8816 5.7771 5.7023 1.1365 6.2385 5.3259 6.1427 8.5283 6.2906 2.9504 3.4723 3.1755 5.4548 6.0183 3.1208 7.1612 6.8647 4.1645 6.3008 1.2497 1.0762 3.3672 5.2064 1.2313 5.8619 1.3641 1.5389 2.8255 1.7274 3.0510 1.1624 6.4844 1.3647 3.2948 1.3415 3.2893 4.6066 2.2546 1.5597 2.0375 1.4902 1.1100 1.1692 3.7678 1.3463 2.4366 1.2273 1.7949 1.1580 1.5710 1.0840 1.4017 1.4645 1.5898 5.1332 1.2197 1.2379 2.9633 1.0798 1.0670 1.0433 1.0630 1.0916 2.5005 2.6953 4.5048 6.4785 8.3203 6.9177 1.0585 1.0367 1.0599 1.0566 1.1003 1.1036 1.1041 1.0565 1.0994 1.1047 1.0901 1.1094 1.0949 1.0905 1.0959 1.0764
irintensity: 0.1789 0.2338 0.2922 0.0711 3.1068 8.7177 8.2564 0.0451 0.0204 0.8507 4.2315 3.2404 6.2288 1.1365 0.1312 7.5305 1.6789 0.2959 26.9785 8.8068 0.0004 7.8673 12.8481 4.2205 5.8810 1.6876 3.6481 14.0813 31.9844 84.1383 19.8606 17.0683 26.6831 3.4339 1.4261 4.6066 29.2530 60.4157 24.2255 12.9247 1.8825 0.7047 5.0588 0.0050 46.9482 1.3284 5.8551 411.2437 5.9869 15.2221 0.4497 2.3516 0.4196 110.4885 24.0802 0.0413 328.1684 33.1170 28.3583 1.2498 102.4286 0.1098 31.5226 4.6626 2.5686 69.8704 8.4256 34.1254 10.8159 0.6914 0.5701 12.5444 6.0038 19.1164 2.0870 656.5886 47.6968 386.0345 84.4252 65.2213 28.2866 32.1059 13.4389 45.6300 6.5138 2.2350 0.8240 3.3588 51.8367 126.0728 12.6231 0.5482 4.0125 0.9612 2.0110 94.9182
temp: 298.150 k
press: 1.00000 atm
elementType: 17 8 8 8 7 6 6 6 6 6 6 6 6 6 6 6 6 6 1 1 1 1 1 1 1 1 1 1 1 1 1 1 1 1
symmnumber: 1
zpe: 705684.4 jmol-1
zpe.correction: 0.268781 hartree
zpe.thermalcorrener: 0.287658 hartree
zpe.thermalcorrenthalpy: 0.288602 hartree
zpe.thermalcorrgfe: 0.217970 hartree
zpe.sumelectzpe: -1244.151193 hartree
zpe.sumelectthermal: -1244.132316 hartree
zpe.sumelectthermalent: -1244.131372 hartree
zpe.sumelectthermalfe: -1244.202003 hartree
dipole: -0.3696 -0.5328 0.0286
dipole: 0.6491
quadrupole: -92.9819 -122.1781 -114.0567
quadrupole: -7.7055 -0.1365 0.0309
quadrupole: 16.7570 -12.4392 -4.3178 -7.7055 -0.1365 0.0309
hfenergy: -1244.4199735 hartree
pointgroup: C01 [X(C13H16Cl1N1O3)]
dipole: -0.1593912 0.1941561 -0.0459975 debye
polarizability: 286.5316967|-2.1193485|173.4410984|9.6467534|-11.2040477|89.7137712 unknown
InChI: InChI=1S/C13H16ClNO3/c1-2-3-8-18-13(17)10-4-6-11(7-5-10)15-12(16)9-14/h4-7,15H,2-3,8-9H2,1H3
charge 0 multiplicity 1
34 atoms
Cl -6.641258 -1.010657 -0.310425
O  2.738007 -0.081256 0.03741
O  2.441629 -2.376211 0.328222
O  -3.941742 2.035797 -0.549467
N  -3.699632 -0.295456 -0.252773
C  4.871861 1.074235 -0.081586
C  6.414183 0.986093 0.012316
C  4.212672 -0.287176 0.138088
C  7.094122 2.352088 -0.221715
C  0.497553 -0.930311 0.039869
C  -2.289633 -0.456283 -0.161144
C  1.951501 -1.230966 0.151972
C  -0.418793 -2.01078 0.127984
C  0.002123 0.385058 -0.149468
C  -1.79861 -1.778183 0.028246
C  -1.379765 0.632478 -0.250251
C  -4.419429 0.867178 -0.430561
C  -5.946566 0.747336 -0.490992
H  4.491614 1.79058 0.672072
H  4.579032 1.465117 -1.075103
H  6.702119 0.594279 1.008908
H  6.788732 0.254006 -0.731708
H  4.439384 -0.707169 1.135977
H  4.51649 -1.029573 -0.623301
H  6.846251 2.750988 -1.223077
H  6.761013 3.094546 0.527499
H  8.194046 2.271053 -0.152043
H  -0.025743 -3.02184 0.274326
H  0.711522 1.21429 -0.216917
H  -2.501163 -2.617982 0.096941
H  -1.761649 1.644369 -0.395063
H  -4.264468 -1.15056 -0.176635
H  -6.392669 1.333864 0.325306
H  -6.305134 1.11575 -1.463107
