program: Gaussian 09
title: 000236719
version: EM64L-G09RevD.01
frameworkgroup: C1[X(C12H14ClNO)]
method: RPBEPBE
basis: SDD
operation: Freq
keyword: #p
keyword: freq=noraman
keyword: PBEPBE/SDD
title: #p freq=noraman PBEPBE/SDD
converged: YES YES NO NO
title: Mulliken charges:
elementType: Cl O N C C C C C C C C C C C C H H H H H H H H H H H H H H
charge: -0.069622 -0.253357 -0.454519 -0.429201 -0.414121 -0.542647 -0.527719 0.080510 0.450004 0.327151 -0.354080 -0.384084 -0.249274 0.213671 -0.804828 0.211501 0.213017 0.206996 0.215519 0.211520 0.223872 0.249088 0.234276 0.314245 0.255391 0.334029 0.235805 0.270425 0.236432
chargesum: 0.00000
title: Mulliken charges with hydrogens summed into heavy atoms:
elementType: Cl O N C C C C C C C C C C C C
charge: -0.069622 -0.253357 -0.120490 -0.004684 0.008394 -0.107255 -0.044355 0.080510 0.450004 0.327151 -0.354080 -0.069839 0.006117 0.213671 -0.062166
polarizability: 2.11786762e+02 -4.09498730e+00 1.61795991e+02 -1.95976040e-01 3.41900542e-01 7.97731392e+01
1716.lowfreq: -93.4042 -12.7235 -4.0593 -0.0007 -0.0007 0.0013 7.0484 49.1805 62.3528
frequency: -93.3966 49.1605 62.3483 99.0181 107.1546 128.9928 162.7218 197.8518 260.2730 264.4942 285.5371 305.8834 350.7142 387.1378 436.0166 451.8132 468.9533 499.1675 535.5541 565.0865 588.5016 601.6937 621.2476 637.0991 720.6759 750.7739 809.6462 834.8149 841.3609 862.1011 890.6664 913.9267 936.0866 974.3657 976.6424 996.3697 1029.9963 1040.8863 1083.7469 1104.9050 1137.6698 1142.1149 1165.4829 1184.6525 1194.4581 1229.2155 1255.7990 1275.1079 1288.7240 1326.6766 1335.0184 1349.4020 1354.4640 1369.8368 1376.2249 1408.4978 1435.3749 1448.6636 1459.1812 1461.6980 1468.3501 1470.6161 1474.8037 1511.2060 1584.9573 1597.8692 1637.6357 2929.8025 2970.9385 2972.4098 2983.7650 2986.9767 2991.5786 3038.9471 3046.2354 3054.0704 3071.7785 3136.0545 3168.0237 3197.1400 3541.7078
redmass: 1.0403 5.9524 4.1891 2.7612 2.8738 4.5616 4.0862 6.9033 8.4626 2.8225 4.8056 1.8266 4.6228 4.9457 3.6953 3.6231 4.0339 3.6905 2.8471 3.4496 3.1868 3.7305 2.8818 1.4295 3.6526 5.1201 3.6148 1.4735 1.4588 3.5032 2.6436 1.5355 3.9872 2.0348 1.3145 2.0864 1.6581 2.8369 1.8646 1.8500 1.9846 1.2368 1.3095 1.9123 1.7772 3.2639 1.2639 1.1767 2.5883 1.6359 1.6368 1.3950 2.0247 2.5964 1.2565 3.0459 2.5031 1.2658 1.1416 1.1009 1.0470 1.0859 1.1066 1.9800 6.7639 6.4730 4.7415 1.0593 1.0672 1.0891 1.0631 1.0385 1.0709 1.0932 1.0986 1.1039 1.0984 1.0978 1.0910 1.0956 1.0756
irintensity: 0.0214 7.9638 1.2061 0.1402 0.8227 3.4919 1.0222 1.0226 1.8677 8.8421 4.7663 0.7411 1.2672 8.7030 0.6940 5.2985 7.2778 0.8963 3.5952 12.8341 3.3131 11.8756 11.6381 42.7551 1.4857 7.1906 26.3483 15.6590 40.5075 5.2636 7.5374 3.3542 30.4584 12.7445 4.8983 4.2605 7.4750 3.3469 0.5290 2.4293 18.8914 1.1614 3.0667 8.3714 0.9962 58.0438 6.4455 0.9428 41.4026 1.6654 13.3433 1.7845 42.5046 90.1344 64.4017 73.8210 43.4804 123.9885 3.1575 42.7671 21.7533 10.6505 11.1761 347.5171 23.4260 32.6376 133.0114 34.0764 14.8164 11.1775 30.4106 8.5768 55.5458 15.5224 60.9487 56.1799 15.7739 7.5672 2.6325 9.9484 25.0999
temp: 298.150 k
press: 1.00000 atm
elementType: 17 8 7 6 6 6 6 6 6 6 6 6 6 6 6 1 1 1 1 1 1 1 1 1 1 1 1 1 1
symmnumber: 1
zpe: 615278.4 jmol-1
zpe.correction: 0.234347 hartree
zpe.thermalcorrener: 0.247753 hartree
zpe.thermalcorrenthalpy: 0.248697 hartree
zpe.thermalcorrgfe: 0.193718 hartree
zpe.sumelectzpe: -1054.638354 hartree
zpe.sumelectthermal: -1054.624947 hartree
zpe.sumelectthermalent: -1054.624003 hartree
zpe.sumelectthermalfe: -1054.678982 hartree
dipole: -0.9214 5.5916 0.1651
dipole: 5.6694
quadrupole: -97.4722 -93.5131 -97.4425
quadrupole: -8.1200 -0.6856 -0.0951
quadrupole: -1.3296 2.6295 -1.2999 -8.1200 -0.6856 -0.0951
hfenergy: -1054.8727007 hartree
pointgroup: C01 [X(C12H14Cl1N1O1)]
dipole: 0.0649433 2.2281226 0.0802221 debye
polarizability: 208.421156|-13.1733817|165.1508294|-0.4942163|0.991582|79.7839069 unknown
InChI: InChI=1S/C12H14ClNO/c1-8(15)14-12-7-6-11(13)9-4-2-3-5-10(9)12/h6-7,14H,2-5H2,1H3
charge 0 multiplicity 1
29 atoms
Cl 3.087576 -2.668349 -0.053778
O  -3.715353 -1.045882 -0.03676
N  -2.017141 0.58485 0.029378
C  1.828729 2.630144 -0.388162
C  2.927366 1.920575 0.424466
C  0.445597 2.024209 -0.064148
C  3.005539 0.436939 0.015713
C  0.428529 0.493604 -0.033071
C  1.644087 -0.2489 -0.020195
C  -0.825839 -0.19934 -0.012228
C  1.55035 -1.661465 -0.036596
C  -0.874181 -1.615617 -0.024904
C  0.327699 -2.34883 -0.045039
C  -3.352023 0.164294 0.020663
C  -4.353226 1.320066 0.090053
H  2.043811 2.510764 -1.468522
H  1.813715 3.715564 -0.176561
H  2.69851 2.004414 1.505761
H  3.908374 2.403968 0.260905
H  -0.278593 2.39296 -0.821552
H  0.105998 2.416553 0.920027
H  3.670165 -0.118417 0.702363
H  3.47689 0.353349 -0.985227
H  -1.840665 -2.120968 -0.021197
H  0.307023 -3.441845 -0.059303
H  -1.879938 1.59559 0.081436
H  -4.217573 1.916611 1.011433
H  -5.369606 0.901302 0.088151
H  -4.248116 1.997855 -0.777606
