program: Gaussian 09
title: 000236717
version: EM64L-G09RevD.01
frameworkgroup: C1[X(C15H14O2)]
method: RPBEPBE
basis: SDD
operation: Freq
keyword: #pfreq=noraman
keyword: PBEPBE/SDD
title: #p freq=noraman PBEPBE/SDD
converged: YES YES NO NO
title: Mulliken charges:
elementType: O O C C C C C C C C C C C C C C C H H H H H H H H H H H H H H
charge: -0.252280 -0.156624 -0.656587 0.466160 0.156431 -0.372639 -0.379565 -0.420404 0.351316 -0.222286 -0.224925 -0.240019 -0.337741 -0.377224 -0.227877 -0.196481 -0.255095 0.257494 0.238343 0.233843 0.252770 0.245487 0.236706 0.231030 0.230294 0.232817 0.249345 0.257874 0.223292 0.228537 0.228005
chargesum: 0.00000
title: Mulliken charges with hydrogens summed into heavy atoms:
elementType: O O C C C C C C C C C C C C C C C
charge: -0.252280 -0.156624 -0.160750 0.466160 0.156431 0.113974 -0.134078 -0.183698 0.351316 0.008744 0.005370 -0.007201 -0.088395 -0.119350 -0.004585 0.032056 -0.027090
polarizability: 1.81561977e+02 -1.13241160e+01 1.79723596e+02 -3.02938902e-01 7.58752679e+00 1.15312569e+02
1716.lowfreq: -6.6043 -4.3258 -0.0010 -0.0006 -0.0002 3.8967 17.0618 24.6575 27.5338
frequency: 16.7870 24.6218 27.4725 48.8761 61.6581 98.1184 140.2939 197.1701 227.1308 231.3953 312.4510 330.4461 403.2461 412.2284 423.1629 454.8002 480.6096 502.4348 528.6886 597.3270 609.3650 617.5177 629.6989 693.4449 706.4321 755.3220 758.3055 787.7577 804.9587 823.8304 843.1702 857.6707 870.6433 892.0928 924.0969 961.8972 979.9424 982.2900 983.5536 985.0743 990.2661 998.5678 1013.1242 1026.6568 1028.4147 1080.3078 1083.1685 1110.2565 1166.7106 1170.7024 1174.5075 1181.6568 1189.6069 1208.8701 1215.8418 1221.3281 1285.1848 1314.1202 1327.6342 1353.9643 1380.2531 1390.6938 1436.0963 1439.8413 1444.5028 1444.6964 1479.4139 1483.6308 1591.2483 1591.7528 1611.2565 1612.3197 1655.2304 2935.2051 2984.1476 2987.9658 3063.5009 3116.6075 3120.8704 3128.3912 3135.6121 3137.9193 3147.9567 3154.7084 3164.0894 3165.7319 3174.1670
redmass: 4.2984 3.8043 4.4274 6.9127 5.1173 5.2780 2.5724 4.9727 5.2351 6.6817 3.8672 2.7385 2.8223 2.9484 4.8965 3.1208 3.0585 2.8912 6.5616 5.2095 6.1847 6.1500 4.1424 2.0541 1.7769 2.3112 1.6490 2.8523 4.0601 1.3177 1.9591 1.2755 3.0396 1.4550 1.4644 1.3667 1.3883 5.6040 1.3655 1.9238 5.1519 1.3225 4.1461 2.2302 2.5264 1.6706 1.5399 2.2009 1.1149 1.2606 1.0722 1.2051 1.1248 2.3099 1.1802 3.5335 1.4895 1.3292 1.2760 1.6302 8.2378 5.8447 1.2581 1.7099 1.2308 1.9790 2.1801 2.2843 6.2779 6.1710 6.1839 6.2836 9.6728 1.0555 1.0836 1.0802 1.0974 1.0881 1.0873 1.0848 1.0906 1.0889 1.0957 1.0925 1.0961 1.1015 1.1000
irintensity: 1.3935 0.0347 0.0497 0.2333 2.9070 0.9626 9.1041 3.2441 0.4344 0.2584 0.6761 0.9672 0.0157 0.2887 5.9832 0.4286 15.5734 11.4095 9.0170 5.4312 2.5422 0.1410 22.1800 32.7803 57.9240 36.2289 85.6721 4.0065 15.2146 0.9072 1.2384 0.0267 10.2684 7.9745 0.3014 0.3126 0.0269 2.9618 0.3421 1.7478 2.0987 0.3418 37.9222 16.3918 78.3334 19.1893 9.9694 84.5309 24.1587 49.8367 8.7812 4.0558 0.9209 18.6079 20.6829 149.3297 4.9735 0.2342 1.0176 19.1867 0.9504 3.8863 53.3273 2.3694 16.9806 17.0668 92.9000 21.8965 25.0945 6.2685 39.8637 59.7328 138.4778 64.3666 3.8376 24.5802 6.0250 8.5107 4.2729 2.6169 7.4376 11.4115 33.2770 35.6331 16.3463 19.3382 6.0465
temp: 298.150 k
press: 1.00000 atm
elementType: 8 8 6 6 6 6 6 6 6 6 6 6 6 6 6 6 6 1 1 1 1 1 1 1 1 1 1 1 1 1 1
symmnumber: 1
zpe: 646609.6 jmol-1
zpe.correction: 0.246281 hartree
zpe.thermalcorrener: 0.261289 hartree
zpe.thermalcorrenthalpy: 0.262233 hartree
zpe.thermalcorrgfe: 0.200280 hartree
zpe.sumelectzpe: -729.212444 hartree
zpe.sumelectthermal: -729.197436 hartree
zpe.sumelectthermalent: -729.196492 hartree
zpe.sumelectthermalfe: -729.258444 hartree
dipole: 2.1038 -3.6942 -1.1330
dipole: 4.3996
quadrupole: -92.1629 -103.9755 -96.1236
quadrupole: -0.1631 -0.0146 -1.7330
quadrupole: 5.2577 -6.5548 1.2971 -0.1631 -0.0146 -1.7330
hfenergy: -729.4587249 hartree
pointgroup: C01 [X(C15H14O2)]
dipole: -0.8190738 -0.2042442 1.5111332 debye
polarizability: 181.5830306|1.0351049|121.8062485|-11.600552|-20.6439944|173.2088628 unknown
InChI: InChI=1S/C15H14O2/c16-14(11-13-7-3-1-4-8-13)12-17-15-9-5-2-6-10-15/h1-10H,11-12H2
charge 0 multiplicity 1
31 atoms
O  1.615495 0.660303 -1.219496
O  -0.332906 1.311557 -3.02133
C  -2.072911 1.686912 -1.34443
C  -2.704899 0.776953 -0.298699
C  -0.671061 1.245657 -1.818748
C  0.260116 0.740893 -0.70945
C  -3.164687 -0.516201 -0.664887
C  -2.832455 1.186206 1.052861
C  2.601055 0.146061 -0.354045
C  -3.733435 -1.378646 0.297753
C  -3.402451 0.325445 2.019158
C  -3.852424 -0.961336 1.644797
C  2.360948 -0.280997 0.975689
C  3.903166 0.0774 -0.90811
C  3.4402 -0.779941 1.743717
C  4.965269 -0.420595 -0.12911
C  4.74153 -0.853087 1.202166
H  -2.699201 1.763264 -2.250955
H  -1.965329 2.712535 -0.936399
H  0.193587 1.424139 0.165321
H  -0.107206 -0.253422 -0.374172
H  -3.081566 -0.843244 -1.708972
H  -2.494488 2.187293 1.349257
H  -4.086471 -2.37196 -0.001038
H  -3.499339 0.659955 3.058098
H  -4.29607 -1.629134 2.391425
H  1.361593 -0.232782 1.418968
H  4.051979 0.414174 -1.938468
H  3.254745 -1.111341 2.771783
H  5.97058 -0.472828 -0.561658
H  5.570036 -1.240033 1.804475
