program: Gaussian 09
title: 000236713
version: EM64L-G09RevD.01
frameworkgroup: C1[X(C16H16O)]
method: RPBEPBE
basis: SDD
operation: Freq
keyword: #pfreq=noraman
keyword: PBEPBE/SDD
title: #p freq=noraman PBEPBE/SDD
converged: YES YES NO NO
title: Mulliken charges:
elementType: O C C C C C C C C C C C C C C C C H H H H H H H H H H H H H H H H
charge: -0.213156 -0.522345 0.515903 0.487256 0.242741 -0.501189 -0.446317 -0.380301 -0.341320 -0.429347 -0.677212 -0.226460 -0.243530 -0.236208 -0.226437 -0.244495 -0.243624 0.201366 0.237853 0.243063 0.222431 0.273964 0.247652 0.227457 0.234027 0.229088 0.211579 0.224117 0.226671 0.224632 0.225391 0.227585 0.229162
chargesum: 0.00000
title: Mulliken charges with hydrogens summed into heavy atoms:
elementType: O C C C C C C C C C C C C C C C C
charge: -0.213156 -0.320979 0.515903 0.487256 0.242741 -0.020273 -0.223886 -0.106337 -0.093668 -0.201890 -0.002517 -0.002342 -0.016859 -0.011576 -0.001045 -0.016909 -0.014462
polarizability: 1.93959583e+02 3.34947274e+00 1.47023874e+02 -7.21956467e+00 -3.73176231e+00 1.60765527e+02
1716.lowfreq: -12.0649 -4.2191 -0.0003 0.0003 0.0007 5.5959 11.9808 17.1681 40.6066
frequency: 11.5329 16.7605 40.5622 62.9598 84.6576 102.1227 132.3095 186.0214 208.8369 232.3053 248.5176 274.6451 277.8464 338.3892 401.8184 405.5502 474.5981 491.6332 493.2986 597.3176 613.1633 615.4900 619.2219 677.1677 698.5057 707.7334 752.7498 755.8089 781.2562 818.0298 842.9643 852.4848 856.2329 863.1633 916.4209 931.1422 968.0322 981.4026 988.6616 989.4267 991.5927 997.9641 1001.0135 1026.7159 1028.2425 1037.9079 1065.2305 1079.1566 1089.3989 1110.4306 1170.6599 1171.6774 1176.2673 1189.2214 1194.5991 1195.0311 1235.3170 1256.6311 1277.8247 1327.9622 1339.5747 1340.9948 1380.9996 1385.7599 1397.4908 1428.3344 1440.2159 1441.8861 1470.0003 1477.7511 1478.7280 1480.7033 1590.2567 1592.7322 1605.8177 1609.5742 1634.6587 2958.5760 2998.2629 3002.1845 3009.0987 3094.8568 3100.6781 3110.8008 3115.8724 3125.8812 3126.8257 3138.4822 3140.0498 3149.3444 3157.5491 3163.3125 3172.3634
redmass: 3.9197 3.9711 4.1416 4.4460 2.0645 3.0766 4.7245 1.3584 3.1168 4.1155 4.3447 4.7888 4.1731 6.0029 2.7852 2.8623 3.1905 3.2038 3.7335 3.4961 5.1323 5.9618 4.8145 4.0357 1.7184 1.7695 1.8030 2.2481 1.8933 3.5108 1.2587 2.3391 1.3788 2.8728 1.5557 1.5044 1.3959 1.4270 4.4924 4.5740 1.4016 1.9521 1.6204 2.2457 2.2355 1.9257 1.6754 1.6325 1.6101 2.3764 1.3098 1.0931 1.8238 1.1399 1.1310 2.3478 1.2543 1.4330 1.4589 1.5905 1.2800 1.4411 7.4534 6.0413 1.2102 1.1014 2.1794 2.0814 1.0391 2.2047 1.0720 2.1247 6.0202 6.0271 6.0474 5.9613 7.6264 1.0612 1.0369 1.0959 1.0838 1.1004 1.0998 1.0875 1.0868 1.0866 1.0867 1.0921 1.0927 1.0955 1.0974 1.1014 1.0972
irintensity: 1.0017 2.1658 0.1474 0.3326 3.0477 1.1680 1.1306 1.5596 0.5716 3.6575 0.1786 0.3209 1.2762 9.1309 0.1732 0.0428 4.3945 0.6512 7.7630 6.4206 11.5964 5.5401 17.7403 3.0269 44.1176 61.2773 31.8240 37.0359 3.7120 2.2385 0.1123 7.6385 0.6722 0.7601 1.6795 1.0061 0.1880 0.4261 9.7074 1.5747 0.1315 11.7176 12.8497 8.4180 10.6508 40.1241 2.3555 0.5963 19.6951 54.9938 0.3286 0.0252 0.9422 1.2923 0.3322 3.8421 2.5272 1.4701 38.2526 17.8795 3.3321 35.6997 1.2509 0.4484 20.0586 18.0202 18.6453 2.6514 12.4872 43.0908 17.9176 8.5826 3.4532 1.7222 17.7420 7.9593 55.3721 25.3267 28.7282 8.8851 19.2667 27.0739 27.0117 9.6562 6.9831 0.7734 0.6764 18.1421 35.2978 18.4952 37.5972 26.7615 6.1913
temp: 298.150 k
press: 1.00000 atm
elementType: 8 6 6 6 6 6 6 6 6 6 6 6 6 6 6 6 6 1 1 1 1 1 1 1 1 1 1 1 1 1 1 1 1
symmnumber: 1
zpe: 709344.9 jmol-1
zpe.correction: 0.270175 hartree
zpe.thermalcorrener: 0.285775 hartree
zpe.thermalcorrenthalpy: 0.286719 hartree
zpe.thermalcorrgfe: 0.223922 hartree
zpe.sumelectzpe: -693.314429 hartree
zpe.sumelectthermal: -693.298829 hartree
zpe.sumelectthermalent: -693.297884 hartree
zpe.sumelectthermalfe: -693.360682 hartree
dipole: -0.4670 -0.0737 -2.4561
dipole: 2.5011
quadrupole: -93.4853 -99.3289 -94.1202
quadrupole: 0.2795 -2.2371 -6.4668
quadrupole: 2.1595 -3.6841 1.5246 0.2795 -2.2371 -6.4668
hfenergy: -693.5846038 hartree
pointgroup: C01 [X(C16H16O1)]
dipole: -0.2805117 -0.0350294 0.9425444 debye
polarizability: 190.8295108|8.18382|148.3117055|11.0824346|-1.2820879|162.6077678 unknown
InChI: InChI=1S/C16H16O/c1-2-15(17)16(13-9-5-3-6-10-13)14-11-7-4-8-12-14/h3-12,16H,2H2,1H3
charge 0 multiplicity 1
33 atoms
O  0.785256 -1.873069 -1.378222
C  0.172738 -0.494839 0.566573
C  1.288609 0.541681 0.362295
C  -1.221159 0.013258 0.148872
C  0.51143 -1.829576 -0.151096
C  0.479854 -3.080617 0.723207
C  2.106396 0.90496 1.462117
C  -1.686837 -0.041646 -1.190293
C  1.537721 1.134786 -0.90139
C  -2.059978 0.585874 1.139849
C  0.731659 -4.389456 -0.042043
C  3.151225 1.844555 1.308696
C  -2.960207 0.47109 -1.526017
C  2.5828 2.071419 -1.056372
C  -3.331127 1.101086 0.80373
C  3.392771 2.431629 0.046209
C  -3.786601 1.046053 -0.533858
H  0.125362 -0.714238 1.649922
H  1.232319 -2.939187 1.528733
H  -0.500311 -3.099262 1.244955
H  1.922874 0.453397 2.445703
H  -1.060988 -0.499901 -1.963439
H  0.92073 0.860693 -1.761808
H  -1.709931 0.638869 2.178396
H  1.713253 -4.366904 -0.545265
H  -0.031342 -4.539643 -0.825115
H  0.705982 -5.2546 0.6439
H  3.771769 2.116967 2.169994
H  -3.306864 0.419077 -2.564396
H  2.765595 2.521475 -2.038752
H  -3.963585 1.543075 1.581987
H  4.201442 3.160752 -0.077303
H  -4.773152 1.44324 -0.797673
