program: Gaussian 09
title: 000236712
version: EM64L-G09RevD.01
frameworkgroup: C1[X(C4H9NO3)]
method: RPBEPBE
basis: SDD
operation: Freq
keyword: #pfreq=noraman
keyword: PBEPBE/SDD
title: #p freq=noraman PBEPBE/SDD
converged: YES YES NO NO
title: Mulliken charges:
elementType: O O O N C C C C H H H H H H H H H
charge: -0.455670 -0.315782 -0.434388 -0.357723 -0.126051 0.223936 -0.657406 -0.295327 0.220972 0.189720 0.253406 0.232563 0.316901 0.222178 0.238061 0.367242 0.377369
chargesum: 0.00000
title: Mulliken charges with hydrogens summed into heavy atoms:
elementType: O O O N C C C C
charge: -0.088427 -0.315782 -0.057019 -0.040822 0.094921 0.223936 0.018282 0.164912
polarizability: 7.17847198e+01 -1.62680217e+00 6.35203979e+01 -1.11024992e+00 -4.61526404e+00 4.55406099e+01
1716.lowfreq: -11.2962 -2.9587 -0.0011 -0.0010 -0.0006 15.3491 38.9286 77.6512 95.0966
frequency: 38.4918 77.5931 95.0828 196.9549 222.4250 245.5469 338.7328 378.6196 413.5235 455.9005 518.5190 530.5826 577.2244 629.7561 730.1801 816.2687 891.8140 963.6578 987.4815 1018.0768 1042.7393 1076.7663 1116.0594 1203.4551 1234.5948 1263.2657 1310.5314 1338.2144 1376.4758 1388.0253 1400.0250 1452.7343 1456.2940 1473.2462 1490.0057 1591.3920 2969.4561 2988.1672 3007.5555 3087.0277 3108.8899 3119.9710 3402.6070 3527.0966 3553.7993
redmass: 4.1302 5.1805 4.9930 2.7301 1.4941 1.7231 4.8928 4.2197 2.5189 1.3098 1.3989 1.1536 2.6979 3.9527 3.6200 2.7374 2.4851 3.9143 3.4316 2.1657 1.8198 2.7288 2.0470 1.3650 1.3147 1.6225 1.2399 1.1837 1.3435 1.2035 1.1408 1.1237 1.0710 1.1068 1.8544 6.0709 1.0833 1.0369 1.0656 1.0984 1.1009 1.1009 1.0644 1.0653 1.0786
irintensity: 1.2216 8.4497 1.7759 0.6106 0.1554 1.1364 44.4602 17.1099 50.2018 58.2764 92.7452 112.0621 119.2959 25.2856 11.7927 11.9328 5.5096 163.1648 55.2902 58.4655 29.2393 55.3091 51.2031 27.9461 17.2562 70.1609 2.8003 31.0971 164.3071 19.7821 25.9727 12.3595 9.2162 12.5788 141.6143 118.5620 36.7938 21.3040 50.9883 34.9084 19.2744 19.7262 53.6145 14.1486 25.5271
temp: 298.150 k
press: 1.00000 atm
elementType: 8 8 8 7 6 6 6 6 1 1 1 1 1 1 1 1 1
symmnumber: 1
zpe: 359506.7 jmol-1
zpe.correction: 0.136929 hartree
zpe.thermalcorrener: 0.146260 hartree
zpe.thermalcorrenthalpy: 0.147204 hartree
zpe.thermalcorrgfe: 0.102063 hartree
zpe.sumelectzpe: -437.587625 hartree
zpe.sumelectthermal: -437.578294 hartree
zpe.sumelectthermalent: -437.577350 hartree
zpe.sumelectthermalfe: -437.622491 hartree
dipole: -0.5508 3.9389 0.1732
dipole: 3.9810
quadrupole: -59.4482 -44.3787 -48.6279
quadrupole: 1.2703 -1.9484 -2.0627
quadrupole: -8.6300 6.4396 2.1904 1.2703 -1.9484 -2.0627
hfenergy: -437.7245541 hartree
pointgroup: C01 [X(C4H9N1O3)]
dipole: -0.5229352 -1.2114169 -0.8439062 debye
dipolederiv: -0.5693063 -0.221873 -0.0276297 -0.0959079 -0.5283667 -0.1392262 -0.0074943 -0.1517526 -0.5934134 -0.7095749 0.0952492 -0.0236113 -0.2040081 -0.9623827 -0.1122171 -0.0452545 -0.0059374 -0.3518922 -0.6115358 0.2398709 -0.0452987 0.3778275 -0.4937027 -0.1070965 0.1663596 -0.1442871 -0.6813973 -1.2649054 -0.1199459 -0.0267755 -0.1189566 -0.5084362 -0.1442581 -0.1796242 -0.1500703 -0.5311712 0.1549542 0.2464065 -0.0045137 0.3264815 0.3682022 0.0967344 -0.0057933 0.081569 0.4604408 1.1562668 0.1243329 0.1075631 0.3757758 1.0668009 0.1522647 0.1839602 0.0522405 0.143228 -0.0235708 0.0719344 0.0520157 0.010927 0.0241057 -0.0616285 -0.061622 -0.0526174 -0.0908538 0.9802283 -0.2124269 -0.0592961 -0.4638734 0.5548741 0.1497558 -0.0976679 0.1324284 0.7089775 -0.0115689 -0.0611719 0.0370969 -0.0600478 -0.0786337 0.0790565 0.0471737 0.0933492 -0.0681256 -0.0145728 -0.150533 -0.0398256 -0.1200993 -0.0577596 -0.0707913 -0.01622 -0.0448405 0.0534575 -0.0903062 0.1057721 -0.0093131 0.0976043 0.0624603 0.0016163 -0.0144734 -0.00279 0.0818537 0.1113264 0.0108134 0.0076639 -0.0178119 -0.0105318 0.1220687 0.0249223 0.0668627 -0.0471077 0.1416765 0.0375427 -0.0442374 0.0680877 0.1194852 0.0175938 -0.0278257 0.0549071 0.3230931 -0.0301935 -0.057949 -0.0303284 -0.0861154 -0.0327447 -0.0858882 -0.0134644 -0.031274 0.0675469 0.0123948 -0.0102716 0.0839105 0.078748 0.0008972 0.0991657 0.0304748 0.0455201 -0.1232099 0.4597155 0.1128486 0.0104508 0.0140971 0.2172747 0.0102266 0.0181153 0.0457384 0.3295079 0.3089722 -0.2105994 0.0121286 -0.1827286 0.2584579 -0.0073764 -0.0015662 0.0109539 0.3190657 unknown
polarizability: 71.9681024|-0.8088261|62.7610649|1.6195416|5.5019681|46.1165603 unknown
InChI: InChI=1S/C4H9NO3/c1-3(7)4(8)5-2-6/h3,5-7H,2H2,1H3
charge 0 multiplicity 1
17 atoms
O  2.408806 0.261372 0.878582
O  0.036169 1.308915 0.255497
O  -2.798491 0.677048 0.908161
N  -1.042113 -0.714107 -0.063864
C  1.417728 -0.704721 0.430697
C  0.080785 0.032136 0.202459
C  1.907912 -1.416131 -0.85087
C  -2.332347 -0.023332 -0.273059
H  1.278743 -1.451469 1.240301
H  1.238408 -2.245104 -1.148576
H  2.912621 -1.828303 -0.660055
H  1.982038 -0.699938 -1.687364
H  -1.020212 -1.729304 0.047434
H  -3.096199 -0.780287 -0.50315
H  -2.208643 0.673849 -1.123745
H  1.990757 1.165497 0.777904
H  -2.19266 1.451877 1.05215
