program: Gaussian 09
title: 000236699
version: EM64L-G09RevD.01
frameworkgroup: C1[X(C8H7NO4)]
method: RPBEPBE
basis: SDD
operation: Freq
keyword: #pfreq=noraman
keyword: PBEPBE/SDD
title: #p freq=noraman PBEPBE/SDD
converged: YES YES NO NO
title: Mulliken charges:
elementType: O O O O N C C C C C C C C H H H H H H H
charge: -0.327635 -0.443931 -0.251329 -0.239616 -0.597703 0.151012 0.292655 -0.309363 -0.349911 -0.232245 -0.197288 0.139176 0.283097 0.281139 0.257138 0.236287 0.236351 0.385376 0.344807 0.341982
chargesum: 0.00000
title: Mulliken charges with hydrogens summed into heavy atoms:
elementType: O O O O N C C C C C C C C
charge: -0.327635 -0.058555 -0.251329 -0.239616 0.089087 0.151012 0.292655 -0.028224 -0.092773 0.004042 0.039063 0.139176 0.283097
polarizability: 1.42739966e+02 -8.09262766e+00 1.14248330e+02 1.07506550e+01 6.03251471e+00 5.88489528e+01
1716.lowfreq: -8.5647 -5.1458 -0.0004 0.0004 0.0007 8.5080 38.0854 78.0533 84.3687
frequency: 38.0573 78.0446 84.3674 102.5913 137.6979 216.8218 257.1472 312.5169 344.8766 412.1187 425.1970 484.1487 500.6994 514.9457 524.0486 548.0515 581.5847 602.5197 635.1617 677.0659 686.1390 702.2720 754.1520 781.1028 785.9226 888.8519 895.0171 972.5117 997.6358 998.8432 1037.9866 1070.0815 1107.9708 1156.9156 1175.2405 1194.5579 1265.4780 1294.5340 1317.3493 1386.9214 1432.8287 1474.8848 1577.1435 1595.4584 1611.7656 1643.1215 1736.5507 3140.5434 3158.8665 3175.2419 3186.5408 3533.4283 3559.6916 3714.4912
redmass: 9.7863 4.5851 7.1789 5.7930 6.3029 7.3133 5.4889 5.5553 6.8855 5.4770 3.3713 4.3518 1.1026 2.6000 1.4852 4.6195 1.2489 5.1374 5.6620 6.8130 4.1346 5.0562 4.4301 4.1607 1.5409 1.5884 5.8087 1.3802 5.3878 1.3480 2.1776 2.0911 1.8939 1.5497 1.1682 3.2089 1.5866 2.9095 2.6007 11.3749 2.3032 2.7160 5.7817 1.2300 6.3962 8.5451 9.6120 1.0867 1.0919 1.0961 1.0973 1.0641 1.0448 1.1054
irintensity: 3.1560 15.0061 5.7997 0.5477 2.3973 0.5073 0.8479 3.0744 3.4738 8.6820 10.5708 27.5546 16.6402 137.8930 143.4845 6.0946 110.1370 41.5342 8.5233 27.2831 70.8979 36.3819 13.5725 9.3331 79.1194 10.0033 138.9165 4.4288 251.5485 0.7810 13.0754 14.4764 69.9004 90.0737 8.0944 274.8245 62.9704 251.3056 99.7190 3.7034 8.2293 54.4360 18.3540 112.8206 23.3152 330.2059 361.4188 3.8176 15.4720 6.6317 7.4185 46.9488 85.5045 54.1083
temp: 298.150 k
press: 1.00000 atm
elementType: 8 8 8 8 7 6 6 6 6 6 6 6 6 1 1 1 1 1 1 1
symmnumber: 1
zpe: 373759.5 jmol-1
zpe.correction: 0.142357 hartree
zpe.thermalcorrener: 0.153942 hartree
zpe.thermalcorrenthalpy: 0.154886 hartree
zpe.thermalcorrgfe: 0.104018 hartree
zpe.sumelectzpe: -663.785336 hartree
zpe.sumelectthermal: -663.773752 hartree
zpe.sumelectthermalent: -663.772808 hartree
zpe.sumelectthermalfe: -663.823676 hartree
dipole: 0.3349 -0.4803 -1.8573
dipole: 1.9474
quadrupole: -54.9218 -62.9809 -80.7247
quadrupole: -0.0888 5.1844 2.2546
quadrupole: 11.2874 3.2282 -14.5156 -0.0888 5.1844 2.2546
hfenergy: -663.9276938 hartree
pointgroup: C01 [X(C8H7N1O4)]
dipole: -0.1113407 0.1183255 -0.748744 debye
dipolederiv: -1.9380622 -0.0629365 -0.2674871 0.276832 -0.2955678 0.1045518 -0.3614453 0.085908 -0.5766506 -0.4761908 -0.441436 0.0869379 -0.3743884 -1.1294954 0.2215789 0.0851186 0.2674568 -0.489653 -0.9622572 0.1261808 0.1711158 0.1934714 -0.7150485 -0.0253624 0.1356068 -0.0023926 -0.3551924 -0.6837605 -0.0004604 0.0958691 0.0343531 -0.3283936 0.0628421 -0.1224932 0.0179666 -1.049493 -1.2978685 -0.0969852 0.3543655 -0.1425308 -0.6645835 -0.0180353 0.3128632 -0.0437169 -0.4427152 -0.3115109 0.319799 -0.003537 0.1346108 -0.5952481 0.0514355 0.1079015 0.0317664 -0.004149 1.2843172 0.1590975 0.023214 -0.1414775 0.3452697 0.0204123 -0.2529043 -0.0778378 0.0310134 0.028344 -0.2241439 -0.0057356 0.0380104 0.1197847 -0.0517767 -0.0415819 0.0021282 -0.0815298 -0.4180538 0.0873177 -0.0410391 0.2523879 -0.0120018 -0.0548844 -0.0535976 -0.0481051 -0.1251307 0.0949723 0.0234495 -0.064318 -0.0508127 -0.3099984 0.0060013 -0.0495581 0.0170764 -0.1596808 0.16943 -0.0019267 -0.0331207 -0.0082986 0.1638328 -0.0400483 -0.0531397 -0.0539143 -0.1041825 1.2761731 -0.1035616 -0.2978401 -0.0964418 1.8599435 -0.2309644 -0.2736133 -0.2757346 0.3731166 2.4536935 0.0093575 -0.1257793 -0.3521726 0.4199097 -0.1592396 0.4133797 -0.0384502 1.6305662 0.0819071 -0.0511625 0.0173836 -0.0571453 0.0434117 0.0323367 0.029179 0.0326718 0.1487755 0.0648672 -0.0709449 0.0380726 -0.058629 -0.0056835 0.0360532 0.0266791 0.0409662 0.1526089 -0.1060151 0.0132074 0.0467038 -0.002366 0.0861978 0.0147535 0.0519152 0.0141321 0.1518607 0.0318419 0.0922227 -0.0014053 0.1015188 -0.0477309 0.0245492 0.0072145 0.029075 0.148468 0.1821499 0.1543719 0.0329217 0.0884115 0.3128514 -0.0080366 0.0463167 -0.0363745 0.3822949 0.2603063 0.0377846 -0.0099215 0.0903209 0.3797443 -0.0123133 -0.058801 0.0082371 0.1993987 0.2657164 0.030769 -0.0164002 0.074346 0.3728056 0.0261464 0.0509601 0.0291415 0.1702741 unknown
polarizability: 141.012568|-11.7857141|114.2255169|-9.8164353|-11.1958103|60.599164 unknown
InChI: InChI=1S/C8H7NO4/c9-8(12)13-6-4-2-1-3-5(6)7(10)11/h1-4,10H,9H2
charge 0 multiplicity 1
20 atoms
O  1.265412 0.890328 -0.644756
O  -0.776802 -2.805461 0.491684
O  1.215043 -1.923346 -0.289416
O  1.98486 0.405415 1.570151
N  3.465861 0.493338 -0.256013
C  -0.730297 -0.452633 0.024135
C  -0.104341 0.782005 -0.32048
C  -2.127786 -0.445609 0.29029
C  -0.858932 1.96883 -0.419803
C  -2.881911 0.738584 0.197853
C  -2.245957 1.9491 -0.167737
C  0.021768 -1.733433 0.050587
C  2.244551 0.546007 0.35984
H  -2.603972 -1.391022 0.561515
H  -0.338856 2.8932 -0.687298
H  -3.956507 0.720179 0.405229
H  -2.824413 2.875905 -0.245649
H  -0.219361 -3.628965 0.485559
H  3.524743 0.521591 -1.270964
H  4.280693 0.255485 0.302169
