program: Gaussian 09
title: 000236698
version: EM64L-G09RevD.01
frameworkgroup: C1[X(C16H14O3)]
method: RPBEPBE
basis: SDD
operation: Freq
keyword: #pfreq=noraman
keyword: PBEPBE/SDD
title: #p freq=noraman PBEPBE/SDD
converged: YES YES NO NO
title: Mulliken charges:
elementType: O O O C C C C C C C C C C C C C C C C H H H H H H H H H H H H H H
charge: -0.255505 -0.419772 -0.287546 0.460294 0.118254 0.350635 -0.341668 -0.392715 -0.379686 -0.417636 -0.353869 0.321055 -0.376403 -0.372699 -0.229090 -0.231753 0.082002 -0.243551 -0.537320 0.221646 0.228261 0.324079 0.247312 0.235777 0.253797 0.242558 0.224801 0.224651 0.228176 0.226820 0.226792 0.247771 0.374530
chargesum: 0.00000
title: Mulliken charges with hydrogens summed into heavy atoms:
elementType: O O O C C C C C C C C C C C C C C C C
charge: -0.255505 -0.045242 -0.287546 0.460294 0.118254 0.350635 -0.120022 -0.164454 -0.055607 -0.170324 -0.118091 0.321055 -0.122605 -0.130141 -0.004289 -0.007102 0.082002 -0.015375 0.164063
polarizability: 3.79283180e+02 5.53900093e+00 1.79804696e+02 4.59779251e+00 1.06245609e+01 9.59977674e+01
1716.lowfreq: -7.8818 -5.4614 -0.0001 0.0006 0.0007 7.0310 22.7552 30.7401 56.3944
frequency: 22.6996 30.7229 56.3707 68.9074 77.5893 100.8313 129.6631 151.3016 188.6782 217.0812 243.8229 252.5327 267.8941 303.6401 358.7594 396.6350 408.0768 414.3288 437.1403 447.0804 500.0446 527.5441 534.0073 567.4002 609.1808 621.4694 634.9474 650.9046 701.9074 724.4427 730.8091 744.8163 761.8443 775.4859 822.7478 832.2058 843.0451 848.1263 913.3635 937.0568 965.5685 970.7021 972.8178 982.7836 988.2135 992.0547 1003.3002 1008.7803 1030.2996 1048.0652 1084.2109 1111.7862 1119.9761 1157.4748 1172.1506 1187.9461 1193.6158 1211.6506 1246.5900 1257.2384 1280.5448 1312.7412 1323.9898 1361.1949 1376.2268 1418.5997 1433.2039 1435.8967 1440.0815 1467.9458 1470.9941 1481.1271 1497.9825 1554.5304 1570.2284 1582.5918 1607.8636 1613.7280 1627.5081 2967.7596 3059.3379 3077.9901 3120.5722 3122.1586 3128.2162 3130.6209 3141.1215 3153.4587 3155.0322 3166.1600 3168.5179 3176.3399 3512.0871
redmass: 5.5293 4.1496 4.5082 5.4294 5.7985 3.8028 4.7813 4.4334 6.4945 1.3725 5.0501 3.4338 3.2171 5.0321 9.1939 3.8545 2.9430 3.5589 3.3888 4.1401 3.4358 4.3622 2.8135 4.0876 1.8874 2.4889 6.7609 6.2369 1.7265 5.5194 3.8075 3.6290 6.2311 2.6658 1.3015 4.7163 1.5148 1.2723 1.4219 1.4435 4.6116 1.4288 1.5199 8.8703 3.4669 1.5676 2.7031 1.3266 2.2517 2.4267 1.6074 1.2597 1.4361 1.3517 1.0516 1.4190 1.1345 1.9780 2.4024 3.7251 1.9930 1.3747 1.4796 3.2921 7.2757 1.8142 2.8910 1.4763 1.7978 1.0500 1.0902 2.2831 2.3184 8.0771 5.5080 6.0114 6.1650 6.2946 6.3641 1.0325 1.1043 1.0858 1.0850 1.0895 1.0875 1.1001 1.0929 1.0960 1.0890 1.1009 1.0950 1.0960 1.0638
irintensity: 0.4250 1.4694 0.8955 0.4736 0.8423 1.5363 2.9350 4.7585 0.3598 0.1250 0.3254 1.9716 2.0300 3.3787 1.2745 0.8945 0.6452 3.9728 14.9740 4.0170 11.6267 33.9028 13.5418 76.3542 64.2662 53.8495 4.6902 15.3440 55.1116 4.9997 1.7149 0.5405 19.6457 30.7933 8.2819 12.4054 65.1808 0.8289 8.5866 9.8808 16.0327 2.0585 1.4487 59.6410 0.4278 0.6180 8.2613 4.8057 93.8143 506.1109 8.8814 0.1907 36.1670 6.6076 0.0166 183.2775 10.2831 37.8968 150.5337 46.8369 24.4101 13.9058 2.9466 13.8688 1.9604 234.2249 5.1663 13.9987 14.7760 14.6260 82.1509 7.2732 90.8684 75.6928 235.6930 28.7504 22.8971 13.6657 235.8054 81.8597 42.4173 16.0574 6.0405 10.9013 0.9984 26.2833 25.5986 37.4307 12.2778 23.9703 4.5308 38.5786 52.9740
temp: 298.150 k
press: 1.00000 atm
elementType: 8 8 8 6 6 6 6 6 6 6 6 6 6 6 6 6 6 6 6 1 1 1 1 1 1 1 1 1 1 1 1 1 1
symmnumber: 1
zpe: 672879.6 jmol-1
zpe.correction: 0.256286 hartree
zpe.thermalcorrener: 0.273139 hartree
zpe.thermalcorrenthalpy: 0.274083 hartree
zpe.thermalcorrgfe: 0.209945 hartree
zpe.sumelectzpe: -842.414837 hartree
zpe.sumelectthermal: -842.397985 hartree
zpe.sumelectthermalent: -842.397040 hartree
zpe.sumelectthermalfe: -842.461178 hartree
dipole: -1.6884 0.1266 -0.1766
dipole: 1.7023
quadrupole: -85.9294 -101.4658 -113.2697
quadrupole: -7.1172 2.8944 1.6228
quadrupole: 14.2922 -1.2441 -13.0481 -7.1172 2.8944 1.6228
hfenergy: -842.6711237 hartree
pointgroup: C01 [X(C16H14O3)]
dipole: 0.6616249 -0.0401622 0.0958368 debye
polarizability: 376.8241543|-23.3060047|171.5382928|8.0660919|29.1744809|106.7231964 unknown
InChI: InChI=1S/C16H14O3/c1-19-14-9-7-12(8-10-14)11-15(16(17)18)13-5-3-2-4-6-13/h2-11,17H,1H3
charge 0 multiplicity 1
33 atoms
O  5.437133 -1.11908 -0.21965
O  -2.22201 2.073084 1.830901
O  0.029736 2.304994 1.411509
C  1.24415 -0.382628 -0.131512
C  -1.23967 0.480105 0.323884
C  -2.650428 0.07377 0.000413
C  -0.217505 -0.30984 -0.196217
C  1.831278 -1.524249 -0.778359
C  2.138911 0.54203 0.488681
C  -3.048392 -1.286432 0.115776
C  -3.603349 1.013532 -0.478538
C  4.075477 -0.815097 -0.154839
C  3.212226 -1.745655 -0.791497
C  3.530312 0.330726 0.480273
C  -4.351214 -1.69722 -0.243433
C  -4.902919 0.604253 -0.84271
C  -1.035812 1.665398 1.188112
C  -5.284621 -0.753518 -0.728429
C  6.377142 -0.191721 0.421508
H  -0.62026 -1.12413 -0.818774
H  1.174905 -2.251313 -1.272744
H  1.727864 1.435713 0.961948
H  -2.341412 -2.019981 0.520978
H  -3.322317 2.067614 -0.568283
H  3.649318 -2.620137 -1.282221
H  4.179058 1.067693 0.963387
H  -4.638792 -2.749033 -0.133767
H  -5.618624 1.344616 -1.217629
H  -6.296466 -1.068561 -1.007019
H  6.181271 -0.111852 1.507765
H  6.326772 0.811837 -0.042151
H  7.37097 -0.630709 0.252863
H  -1.996632 2.856294 2.403174
