program: Gaussian 09
title: 000236696
version: EM64L-G09RevD.01
frameworkgroup: C1[X(C16H14N2)]
method: RPBEPBE
basis: SDD
operation: Freq
keyword: #pfreq=noraman
keyword: PBEPBE/SDD
title: #p freq=noraman PBEPBE/SDD
converged: NO YES NO NO
title: Mulliken charges:
elementType: N N C C C C C C C C C C C C C C C C H H H H H H H H H H H H H H
charge: -0.424157 -0.078917 0.155974 -0.095061 0.300934 0.361600 0.179226 -0.387770 -0.387864 -0.397721 -0.397721 -0.783841 -0.225403 -0.225385 -0.230050 -0.230074 -0.238685 -0.242680 0.307424 0.242350 0.242395 0.233896 0.233871 0.228697 0.228807 0.269924 0.228726 0.228723 0.223084 0.223085 0.231066 0.225549
chargesum: 0.00000
title: Mulliken charges with hydrogens summed into heavy atoms:
elementType: N N C C C C C C C C C C C C C C C C
charge: -0.116733 -0.078917 0.155974 -0.095061 0.300934 0.361600 0.179226 -0.145420 -0.145469 -0.163825 -0.163851 -0.056413 0.003323 0.003338 -0.006966 -0.006989 -0.007619 -0.017131
polarizability: 1.75663755e+02 -1.01926189e+00 1.97215466e+02 3.05504682e-02 3.15208572e-02 1.56430481e+02
1716.lowfreq: -50.9084 -40.4196 -2.9482 -1.9724 -0.0002 0.0006 0.0007 4.1175 41.4583
frequency: -50.8783 -40.3479 41.4580 70.2125 79.5495 95.7689 96.7017 221.2711 221.8382 225.8083 317.1992 333.2384 335.4671 395.5509 400.1568 402.0502 474.1231 513.3138 582.0058 610.8660 616.2931 644.3625 656.3100 668.3352 676.4750 702.5136 704.7677 731.5406 740.2582 769.7529 777.3843 849.2237 856.1224 918.7087 927.0501 954.6227 971.3946 972.2273 979.0651 988.9277 989.7173 993.0362 998.2519 1000.6740 1022.4638 1032.4819 1045.4248 1075.7924 1076.2294 1076.4661 1162.9428 1170.6464 1172.7327 1184.7234 1186.9322 1238.1822 1267.0300 1309.0588 1309.5574 1351.5549 1368.4837 1370.2882 1392.5268 1402.9947 1429.2974 1429.6935 1462.5416 1470.3366 1472.8904 1494.5458 1530.9822 1574.4921 1582.4027 1585.0106 1616.6401 1630.4110 2977.3546 3050.4472 3115.9080 3119.1290 3123.7064 3126.0677 3129.5517 3138.1169 3141.0099 3147.5698 3150.7372 3162.0031 3165.2500 3572.4574
redmass: 3.8997 3.8007 5.4320 3.7808 1.4634 2.1115 4.2468 3.4773 4.4251 3.7643 5.3109 5.5446 5.0203 3.4484 2.8078 2.8135 6.4546 3.3441 3.3134 6.4811 6.3348 5.4073 1.9345 6.4945 1.8746 1.6234 1.7927 4.0417 10.5421 1.9756 2.0638 1.2466 1.2422 1.4673 1.4098 7.0208 1.7637 1.3915 1.3871 5.2239 4.7587 1.4720 1.3365 4.6813 2.7876 1.9993 1.4606 1.5922 1.6003 2.7198 4.5453 1.0533 1.0544 1.1127 1.1153 1.9974 4.0325 1.3628 1.3772 4.3140 6.6348 7.1595 1.8744 1.8142 2.2188 2.2118 2.1182 1.0445 1.1884 2.9750 4.5697 6.4634 5.9580 6.0683 6.3582 7.2563 1.0391 1.0983 1.0959 1.0842 1.0846 1.0876 1.0879 1.0925 1.0926 1.0969 1.0969 1.1018 1.1018 1.0814
irintensity: 0.1671 0.1324 0.1403 0.4265 2.3682 2.3914 2.7606 1.4949 0.2593 0.0376 3.6164 0.3899 0.7584 4.7012 0.0718 0.0028 1.7051 9.6049 23.5793 0.0043 0.1071 1.0886 46.5048 3.4242 31.1629 65.6166 47.6327 2.9135 0.0015 40.2978 52.4331 0.0190 1.2166 6.0929 2.4369 17.4541 0.2257 0.0009 0.3440 1.6411 0.1210 0.1582 0.0142 7.9830 9.0074 3.0356 3.6681 10.3218 9.1143 2.1608 13.6411 0.0009 0.0001 1.4725 0.2156 2.6295 29.3593 0.0871 0.7893 46.2780 0.0790 0.0072 28.2429 14.9319 11.7527 2.6421 12.9005 16.2765 3.0008 13.8997 51.1575 11.0509 2.1518 1.1699 7.0506 0.6966 51.5158 21.1938 6.3145 1.5712 1.8678 0.6567 0.5601 26.2178 19.8841 32.1743 43.6479 20.6588 20.0701 29.3708
temp: 298.150 k
press: 1.00000 atm
elementType: 7 7 6 6 6 6 6 6 6 6 6 6 6 6 6 6 6 6 1 1 1 1 1 1 1 1 1 1 1 1 1 1
symmnumber: 1
zpe: 670618.5 jmol-1
zpe.correction: 0.255425 hartree
zpe.thermalcorrener: 0.268870 hartree
zpe.thermalcorrenthalpy: 0.269814 hartree
zpe.thermalcorrgfe: 0.214373 hartree
zpe.sumelectzpe: -726.372329 hartree
zpe.sumelectthermal: -726.358884 hartree
zpe.sumelectthermalent: -726.357940 hartree
zpe.sumelectthermalfe: -726.413381 hartree
dipole: 3.9534 0.1867 -0.0005
dipole: 3.9578
quadrupole: -102.4553 -93.3494 -95.1595
quadrupole: 8.9127 0.0066 0.0072
quadrupole: -5.4673 3.6387 1.8286 8.9127 0.0066 0.0072
hfenergy: -726.6277542 hartree
pointgroup: C01 [X(C16H14N2)]
dipole: -1.548551 -0.1632419 0.0001468 debye
polarizability: 175.8533468|-2.2559473|197.0258448|-0.0321137|-0.0420386|156.4305105 unknown
InChI: InChI=1S/C16H14N2/c1-12-17-15(13-8-4-2-5-9-13)16(18-12)14-10-6-3-7-11-14/h2-11,17H,1H3
charge 0 multiplicity 1
32 atoms
N  -0.984731 -2.379267 0.000448
N  1.262791 -2.302658 0.000215
C  -0.650889 -1.011847 0.000135
C  0.752101 -0.984812 -0.000066
C  -1.680892 0.058948 0.000189
C  1.645284 0.206243 -0.000266
C  0.193168 -3.124396 0.000355
C  -2.181566 0.581642 -1.221996
C  -2.183588 0.579588 1.222425
C  2.087255 0.779042 1.220027
C  2.086521 0.779233 -1.220736
C  0.229526 -4.623062 0.000299
C  -3.163353 1.59723 -1.222691
C  -3.165389 1.595161 1.223208
C  2.944974 1.901622 1.221761
C  2.944241 1.901813 -1.222812
C  -3.659315 2.105527 0.000276
C  3.375592 2.467363 -0.000611
H  -1.937344 -2.744188 0.000579
H  -1.788932 0.194337 -2.169203
H  -1.792479 0.190742 2.169635
H  1.760271 0.335265 2.167399
H  1.758982 0.335596 -2.167984
H  -0.262829 -5.052704 0.893253
H  -0.259641 -5.052574 -0.89448
H  1.282728 -4.943498 0.002091
H  -3.536183 1.994294 -2.17348
H  -3.539786 1.990634 2.174044
H  3.277715 2.332431 2.173097
H  3.276418 2.332766 -2.174279
H  -4.418727 2.895574 0.000313
H  4.041473 3.338056 -0.000742
