program: Gaussian 09
title: 000236706
version: EM64L-G09RevD.01
frameworkgroup: C1[X(C16H20N2O8)]
method: RPBEPBE
basis: SDD
operation: Freq
keyword: #p
keyword: freq=noraman
keyword: PBEPBE/SDD
title: #p freq=noraman PBEPBE/SDD
converged: YES YES NO NO
title: Mulliken charges:
elementType: O O O O O O O O N N C C C C C C C C C C C C C C C C H H H H H H H H H H H H H H H H H H H H
charge: -0.226466 -0.226461 -0.263426 -0.263426 -0.238316 -0.238316 -0.240101 -0.240104 0.048274 0.048276 -0.488589 -0.488598 0.148896 0.148888 -0.107075 -0.107081 -0.516383 -0.516384 0.134517 0.134522 0.251931 0.251931 -0.497000 -0.496995 -0.506175 -0.506175 0.241518 0.250488 0.241512 0.250489 0.292288 0.266310 0.292299 0.266309 0.245178 0.242042 0.245896 0.245178 0.242043 0.245898 0.241007 0.233445 0.241744 0.241742 0.241008 0.233444
chargesum: 0.00000
title: Mulliken charges with hydrogens summed into heavy atoms:
elementType: O O O O O O O O N N C C C C C C C C C C C C C C C C
charge: -0.226466 -0.226461 -0.263426 -0.263426 -0.238316 -0.238316 -0.240101 -0.240104 0.048274 0.048276 0.003417 0.003403 0.148896 0.148888 -0.107075 -0.107081 0.042216 0.042224 0.134517 0.134522 0.251931 0.251931 0.236115 0.236123 0.210021 0.210019
polarizability: 2.88784980e+02 -7.03858237e+00 2.38999517e+02 4.87803372e-05 2.02372966e-03 1.55719460e+02
1716.lowfreq: -1.2823 -0.0006 -0.0006 0.0004 1.6898 3.6799 9.6828 20.8972 23.2462
frequency: 9.6722 20.8589 23.1962 23.2461 25.5820 37.5995 37.6959 52.4142 68.5739 88.1408 88.3561 91.3225 96.1014 103.4655 106.2747 106.4397 124.5272 125.7511 135.3565 158.0674 168.3829 174.9575 177.1036 200.1442 248.7426 254.7331 263.7043 280.2486 280.9112 289.2708 292.0162 336.6806 343.6826 397.9719 419.2413 460.5720 467.2598 514.3553 517.8453 554.9052 555.8953 566.3324 634.1326 645.2969 652.7862 689.7525 693.8565 742.0605 751.6055 768.4245 772.3138 789.5887 805.0559 820.9721 852.9699 882.3577 883.4065 907.9538 950.7184 951.0586 998.1775 1022.7316 1032.5573 1054.1464 1056.7298 1075.1960 1111.6099 1111.6561 1113.4516 1113.4867 1132.1699 1138.6821 1141.2336 1148.8953 1148.9033 1149.2222 1150.3807 1170.9400 1195.3902 1215.8421 1246.0139 1268.6459 1280.4719 1285.8610 1294.0084 1295.7291 1351.2574 1354.2743 1369.9670 1389.2833 1420.8130 1422.8276 1422.8717 1423.8894 1440.1287 1440.3794 1452.8412 1452.9996 1453.3184 1453.3248 1454.8913 1458.2632 1459.2564 1459.3520 1464.3171 1464.3463 1475.4744 1510.9568 1601.2939 1602.2050 1644.6033 1644.9537 3003.6442 3003.7013 3007.1470 3007.2403 3009.4414 3009.5216 3032.9012 3033.0123 3065.7812 3065.8054 3105.1093 3105.1538 3105.5523 3105.6699 3110.0993 3110.1099 3148.8257 3148.8355 3157.7809 3157.7941
redmass: 5.5959 5.4553 6.5858 6.9800 4.9173 5.1169 5.7483 4.8247 4.3632 1.7820 2.6647 2.7051 1.1480 1.7905 1.0923 1.1081 4.3538 3.6465 4.5467 5.0905 3.7272 2.9757 3.5955 5.2636 5.6619 4.9959 7.7552 4.2902 2.8270 3.9625 4.4394 6.2789 5.8218 5.5748 5.4954 4.9961 6.9362 8.7887 5.3215 2.8781 2.6622 4.9363 5.6750 10.4498 5.4908 8.2809 5.9245 5.6451 6.2276 1.5688 5.0940 1.7798 4.7374 7.7755 6.2197 6.0104 7.7496 7.2622 6.2179 6.1758 2.3112 5.3333 2.3238 4.7602 4.5853 5.8876 1.2655 1.2650 1.2666 1.2651 1.9261 3.2458 2.7780 1.4376 1.4370 1.4594 1.5530 1.2919 4.5056 2.7506 3.2710 1.5842 1.4750 1.4732 1.4143 2.6892 1.5838 1.5965 3.8077 6.2188 1.2098 1.1898 1.1897 1.2854 1.1053 1.1006 1.0632 1.0499 1.0503 1.0502 1.1757 1.1495 1.0536 1.0552 1.0519 1.0516 4.5459 11.2991 9.4909 9.5136 8.8320 8.8753 1.0302 1.0302 1.0296 1.0297 1.0590 1.0590 1.0605 1.0605 1.0992 1.0992 1.1040 1.1043 1.1035 1.1033 1.1047 1.1047 1.1047 1.1047 1.1049 1.1049
irintensity: 0.1321 0.0165 2.0858 0.6870 0.0824 1.8310 3.0068 0.0147 0.2666 2.5878 0.0221 0.5901 0.5266 0.4114 0.0103 0.5651 0.6151 1.6316 0.1320 0.7219 8.4944 0.3765 15.4102 10.7588 0.4034 0.4978 6.5187 23.3384 9.5523 0.6624 52.5127 32.3811 2.4225 0.6513 7.7103 3.3686 11.2739 2.0230 1.8718 0.5285 1.9678 0.7739 13.2421 0.5481 6.8282 0.4204 0.3576 2.3232 14.2200 18.1660 8.9878 2.2215 29.0603 2.7819 10.0709 16.1203 2.8939 1.4132 0.7366 23.1729 1.4641 0.0514 0.9324 113.9996 26.3922 386.7239 0.0297 0.0030 0.1711 0.0229 178.5187 210.8303 311.4487 6.7363 0.8367 1.0049 134.7333 7.1561 8.1874 182.9822 3.7655 0.7798 163.5684 38.5420 69.6910 27.2277 73.3680 10.4437 59.7385 120.1316 1.5149 49.8631 0.0631 53.3747 10.3586 21.9796 9.6818 10.2813 0.3828 26.8981 35.4684 32.7827 3.8567 19.8737 24.2832 1.4237 0.8866 0.8693 86.7965 271.3094 41.2121 298.9531 84.3201 4.4115 62.2602 0.0227 8.0703 5.2135 0.2167 15.5999 1.4779 1.3549 17.1400 1.7140 43.7706 0.0610 13.3799 29.5744 2.0947 31.3542 18.1193 7.8618
temp: 298.150 k
press: 1.00000 atm
elementType: 8 8 8 8 8 8 8 8 7 7 6 6 6 6 6 6 6 6 6 6 6 6 6 6 6 6 1 1 1 1 1 1 1 1 1 1 1 1 1 1 1 1 1 1 1 1
symmnumber: 1
zpe: 915234.5 jmol-1
zpe.correction: 0.348594 hartree
zpe.thermalcorrener: 0.377783 hartree
zpe.thermalcorrenthalpy: 0.378728 hartree
zpe.thermalcorrgfe: 0.281667 hartree
zpe.sumelectzpe: -1331.019769 hartree
zpe.sumelectthermal: -1330.990580 hartree
zpe.sumelectthermalent: -1330.989636 hartree
zpe.sumelectthermalfe: -1331.086697 hartree
dipole: 0.0001 -0.0003 1.6569
dipole: 1.6569
quadrupole: -143.9659 -120.6111 -153.0780
quadrupole: 0.4676 -0.0003 0.0003
quadrupole: -4.7475 18.6072 -13.8597 0.4676 -0.0003 0.0003
hfenergy: -1331.3683634 hartree
pointgroup: C01 [X(C16H20N2O8)]
dipole: 0.0003957 -0.0002256 -0.6518636 debye
polarizability: 289.3959984|4.3297785|238.3884443|0.0656675|-0.0398915|155.7195138 unknown
InChI: InChI=1S/C16H20N2O8/c1-23-11(19)7-5-9-13(15(21)25-3)18-10(6-8-12(20)24-2)14(17-9)16(22)26-4/h5-8H2,1-4H3
charge 0 multiplicity 1
46 atoms
O  -0.828447 -3.524536 0.900544
O  0.828202 3.525207 0.89784
O  -5.621626 1.079597 -1.741461
O  5.623964 -1.081062 -1.734632
O  -2.534058 -2.551543 -0.348875
O  2.534915 2.55085 -0.349011
O  -5.70995 0.742055 0.561716
O  5.709875 -0.74123 0.568301
N  -0.66072 1.240026 0.524754
N  0.660637 -1.239707 0.526759
C  -2.886806 0.252244 0.708812
C  2.886533 -0.251684 0.712028
C  -1.391082 0.086282 0.5624
C  1.390956 -0.085924 0.563931
C  -0.70016 -1.16706 0.479477
C  0.700121 1.167328 0.478966
C  -3.564368 0.505434 -0.65928
C  3.565524 -0.506093 -0.65513
C  -1.453478 -2.454357 0.288135
C  1.453627 2.454411 0.286913
C  -5.049831 0.777086 -0.502026
C  5.050875 -0.777309 -0.4961
C  -1.495404 -4.839944 0.720482
C  1.49547 4.840375 0.717173
C  -7.080417 1.348138 -1.725081
C  7.082765 -1.349438 -1.71649
H  -3.344823 -0.633771 1.176267
H  -3.068348 1.119796 1.366477
H  3.344028 0.634782 1.179143
H  3.067441 -1.118613 1.370688
H  -3.437027 -0.376177 -1.313771
H  -3.099986 1.366201 -1.174812
H  3.438688 0.374858 -1.310614
H  3.101814 -1.367447 -1.170287
H  -2.523056 -4.804244 1.119319
H  -0.870411 -5.544038 1.285728
H  -1.528901 -5.103263 -0.349846
H  2.522678 4.804992 1.11718
H  0.86992 5.545096 1.281019
H  1.530172 5.1026 -0.353385
H  -7.30306 2.211611 -1.075777
H  -7.337751 1.561312 -2.771937
H  -7.626844 0.465586 -1.352021
H  7.62872 -0.466438 -1.3438
H  7.304842 -2.212206 -1.066057
H  7.341183 -1.563681 -2.762861
