program: Gaussian 09
title: 000236674
version: EM64L-G09RevD.01
frameworkgroup: C1[X(C13H24O2)]
method: RPBEPBE
basis: SDD
operation: Freq
keyword: #pfreq=noraman
keyword: PBEPBE/SDD
title: #p freq=noraman PBEPBE/SDD
converged: YES YES NO NO
title: Mulliken charges:
elementType: O O C C C C C C C C C C C C C H H H H H H H H H H H H H H H H H H H H H H H H
charge: -0.304322 -0.255377 0.385657 0.316410 -0.028414 -0.542319 -0.469468 -0.419015 -0.418549 -0.433743 -0.110998 -0.742037 -0.755958 -0.732810 -0.714614 0.185995 0.237752 0.239275 0.217368 0.223930 0.228015 0.186056 0.222074 0.205306 0.218244 0.212796 0.227961 0.257188 0.200404 0.211730 0.213909 0.210121 0.233750 0.194586 0.210009 0.254623 0.208331 0.215296 0.210837
chargesum: 0.00000
title: Mulliken charges with hydrogens summed into heavy atoms:
elementType: O O C C C C C C C C C C C C C
charge: -0.304322 -0.255377 0.385657 0.316410 0.157581 -0.065292 -0.028169 -0.004944 0.008831 -0.002703 0.116964 -0.072715 -0.098178 -0.073593 -0.080149
polarizability: 1.63151201e+02 3.77664966e+00 1.39707104e+02 1.92300895e+00 1.06290052e+00 1.23708265e+02
1716.lowfreq: -15.6290 -11.7948 -0.0009 -0.0007 -0.0004 5.3516 26.5906 50.7187 75.4195
frequency: 26.3559 50.3535 75.2916 95.5256 154.9258 164.0183 199.3326 204.8488 213.9811 229.4892 230.3325 258.3898 285.1680 305.5313 309.8318 322.9111 334.0372 385.9705 404.7392 414.0627 448.8837 477.6074 492.4080 526.0053 547.0287 587.0846 668.6797 712.2136 769.8652 784.6670 828.3484 845.4105 856.6505 891.9319 907.6143 909.6144 912.5869 922.7143 935.2123 936.9363 958.3433 966.1463 974.4904 985.9943 999.7848 1023.1877 1035.0919 1051.4175 1066.5783 1116.5135 1133.4235 1152.6003 1172.7629 1173.5420 1178.8100 1190.7245 1213.0015 1217.3082 1220.8405 1244.8445 1279.4405 1281.7304 1281.9554 1304.9505 1308.3146 1310.8046 1319.7174 1326.0047 1347.7314 1360.2533 1371.6395 1379.1703 1392.3194 1399.6311 1445.7094 1451.6261 1453.8253 1461.4919 1465.9391 1466.2652 1467.4314 1475.3970 1475.9445 1478.5352 1487.0651 1489.3755 1505.0658 2901.7448 2932.3828 2969.2736 2970.1948 2977.9238 2979.9214 2994.3774 2995.1312 2995.3814 3000.1273 3025.4538 3048.6851 3056.8945 3058.2990 3060.2050 3065.6609 3067.4056 3068.1923 3077.6447 3084.6196 3094.3787 3100.6313 3101.8490 3108.0642
redmass: 2.5573 2.5877 3.0357 3.3339 1.6436 1.8255 1.6771 1.1311 1.2001 1.9567 1.9226 1.6422 2.6804 2.6477 3.1411 1.8532 2.3072 3.0299 2.2181 2.2496 2.4168 4.2157 3.0475 3.3349 2.0734 3.9149 3.9405 2.8422 3.1751 2.9396 1.9787 2.1951 1.9589 2.2715 2.5160 2.1513 1.6201 1.9248 1.5678 1.4114 1.5951 2.0909 1.9697 1.6495 2.1590 1.4709 1.9021 1.7010 3.0827 2.2627 2.4801 2.2246 2.1474 1.9029 1.7724 2.2900 2.3716 1.8203 1.4056 1.4453 1.4068 1.2812 1.3816 1.2730 1.4418 1.4161 1.4316 1.6126 1.4023 1.2917 1.2095 1.2061 1.2235 1.2030 1.0899 1.0808 1.0782 1.0511 1.0638 1.0761 1.0531 1.0537 1.0966 1.0571 1.0522 1.0540 1.0515 1.0818 1.0669 1.0389 1.0390 1.0375 1.0368 1.0630 1.0716 1.0709 1.0641 1.0626 1.0983 1.0958 1.0981 1.0982 1.1009 1.0982 1.0983 1.1039 1.0989 1.0989 1.1036 1.0980 1.0946
irintensity: 0.0386 0.0571 0.3558 0.7670 0.2326 0.0597 1.0139 0.1447 0.2513 2.0435 0.5207 0.2203 1.1441 6.9518 2.8866 0.4123 0.3338 4.3696 0.4040 0.5385 0.7820 9.3916 0.9165 1.4086 1.4235 4.4360 2.1398 3.9688 3.6413 28.6653 6.7188 0.1220 10.7017 6.4564 1.7798 2.1117 9.9440 35.2893 30.5264 3.2063 12.0432 0.0688 23.9145 19.1628 9.2072 3.9559 60.7191 1.1979 141.1854 1.7548 6.0467 20.0174 23.1906 17.9232 12.3003 12.3269 2.9985 1.6623 2.9599 1.9868 2.0151 6.9922 0.2437 8.4433 3.8340 0.0256 10.7697 24.8121 0.1921 4.5669 13.0651 29.6276 16.7971 22.5027 5.2720 8.1548 9.8732 6.3004 2.9219 7.7989 9.5557 10.0639 5.4423 10.5188 14.0273 18.4989 20.4450 27.7711 63.2588 32.1808 33.8798 35.8970 33.5537 41.4456 31.2004 27.1887 22.9666 13.7868 18.0325 31.6813 13.3064 31.8505 36.4284 45.0035 99.1438 38.7258 39.7032 13.2185 26.3970 22.2632 33.9113
temp: 298.150 k
press: 1.00000 atm
elementType: 8 8 6 6 6 6 6 6 6 6 6 6 6 6 6 1 1 1 1 1 1 1 1 1 1 1 1 1 1 1 1 1 1 1 1 1 1 1 1
symmnumber: 1
zpe: 910500.2 jmol-1
zpe.correction: 0.346791 hartree
zpe.thermalcorrener: 0.363236 hartree
zpe.thermalcorrenthalpy: 0.364180 hartree
zpe.thermalcorrgfe: 0.303791 hartree
zpe.sumelectzpe: -658.991756 hartree
zpe.sumelectthermal: -658.975311 hartree
zpe.sumelectthermalent: -658.974367 hartree
zpe.sumelectthermalfe: -659.034756 hartree
dipole: -0.9124 0.1488 -1.6434
dipole: 1.8856
quadrupole: -90.5252 -95.1060 -94.0416
quadrupole: 2.7802 -0.7063 1.2619
quadrupole: 2.6990 -1.8817 -0.8173 2.7802 -0.7063 1.2619
hfenergy: -659.338547 hartree
pointgroup: C01 [X(C13H24O2)]
dipole: -0.3627683 -0.0340686 0.646213 debye
polarizability: 162.5866102|-5.2295973|140.2824263|-1.7892579|1.131527|123.6975329 unknown
InChI: InChI=1S/C13H24O2/c1-10(2)11-12(3,4)9-14-13(15-11)7-5-6-8-13/h10-11H,5-9H2,1-4H3
charge 0 multiplicity 1
39 atoms
O  0.145948 -0.58545 -0.572752
O  1.150579 1.582834 -0.33091
C  1.364389 0.12988 -0.189534
C  -1.353261 1.304009 0.02966
C  -1.075197 -0.230798 0.210564
C  2.477801 -0.263162 -1.188768
C  1.885157 -0.264285 1.233135
C  -0.029198 2.038776 0.413818
C  3.520112 -1.069023 -0.372648
C  3.412072 -0.452937 1.046202
C  -2.117942 -1.270599 -0.285394
C  -1.739819 1.641823 -1.428817
C  -2.410857 1.84417 1.029703
C  -1.63439 -2.696889 0.08286
C  -3.554591 -1.058602 0.248194
H  -0.876915 -0.413923 1.294573
H  2.918927 0.671113 -1.577834
H  2.044719 -0.821244 -2.03428
H  1.421762 -1.22739 1.520321
H  1.639102 0.482765 2.006822
H  -0.111816 3.114518 0.179534
H  0.142526 1.928748 1.508351
H  4.536724 -1.001626 -0.797823
H  3.238392 -2.139288 -0.338642
H  3.862396 -1.083123 1.833592
H  3.919097 0.531024 1.066455
H  -2.136032 -1.193622 -1.390846
H  -0.948557 1.312145 -2.123363
H  -1.873816 2.733603 -1.54943
H  -2.687375 1.152537 -1.718605
H  -2.35054 2.949306 1.077756
H  -2.240642 1.455451 2.052358
H  -3.439334 1.586625 0.734738
H  -1.649514 -2.843156 1.181376
H  -2.298575 -3.458602 -0.365808
H  -0.607752 -2.868756 -0.278799
H  -3.568836 -0.950607 1.349396
H  -4.173571 -1.938483 -0.007459
H  -4.044269 -0.17316 -0.191198
