program: Gaussian 09
title: 000236673
version: EM64L-G09RevD.01
frameworkgroup: C1[X(C14H18BrNO4)]
method: RPBEPBE
basis: SDD
operation: Freq
keyword: #p
keyword: freq=noraman
keyword: PBEPBE/SDD
title: #p freq=noraman PBEPBE/SDD
converged: YES YES NO NO
title: Mulliken charges:
elementType: Br O O O O N C C C C C C C C C C C C C C H H H H H H H H H H H H H H H H H H
charge: -0.019535 -0.238868 -0.469578 -0.262081 -0.260593 -0.214255 -0.036850 -0.251214 -0.318409 -0.343655 -0.774122 -0.331391 -0.324399 0.603089 -0.475127 -0.464456 0.196147 0.170941 -0.299895 -0.204552 0.237018 0.235123 0.226765 0.211420 0.206657 0.234969 0.251952 0.231689 0.228870 0.221835 0.194318 0.190054 0.220256 0.317797 0.359438 0.272638 0.242774 0.235229
chargesum: 0.00000
title: Mulliken charges with hydrogens summed into heavy atoms:
elementType: Br O O O O N C C C C C C C C C C C C C C
charge: -0.019535 -0.238868 -0.110139 -0.262081 -0.260593 -0.214255 0.200168 -0.016091 0.119776 0.097971 -0.061611 0.084762 0.085911 0.603089 -0.157330 -0.464456 0.196147 0.170941 -0.027257 0.273451
polarizability: 2.51395775e+02 -2.29866240e+01 1.91483189e+02 4.10214311e+00 2.41696028e+00 1.21576161e+02
1716.lowfreq: -6.1087 -0.0007 -0.0005 0.0005 3.6352 7.5633 26.1210 30.1825 45.1329
frequency: 25.8435 30.0554 45.1001 70.1770 82.5232 91.6637 108.5909 144.4086 160.4966 185.1274 199.5383 225.7263 244.2111 259.8648 267.1504 272.4672 322.0033 344.0880 351.5961 361.8838 399.2409 415.5903 432.8719 464.2059 467.9347 511.8407 549.0950 587.0317 628.5816 649.9046 668.6683 678.0632 712.6849 743.0290 762.1554 778.8563 802.3930 807.8926 824.4559 837.2578 840.1912 852.4331 902.8239 916.7809 936.8376 939.4912 972.2717 982.1629 1023.4192 1041.3336 1052.1105 1062.4137 1070.2191 1074.3576 1079.0561 1099.8783 1107.7004 1125.4967 1127.9601 1149.3126 1170.7899 1196.9031 1204.6944 1236.2127 1252.0998 1254.0476 1274.2662 1291.9001 1292.7040 1300.9023 1333.1884 1339.9843 1348.5171 1359.4432 1370.0196 1372.8008 1383.3446 1389.8060 1396.1395 1420.1721 1443.0737 1448.2105 1452.5791 1456.4865 1463.8036 1479.2198 1482.3636 1489.3652 1600.9268 1621.7857 2904.8490 2913.2472 2935.9670 2948.7573 2952.4743 2954.2023 2993.9583 3000.6446 3051.0119 3072.5323 3082.6588 3085.6722 3090.1658 3097.8097 3113.9001 3131.5358 3191.5686 3194.5026
redmass: 5.9034 3.6187 4.5786 4.6797 2.9047 4.6435 5.9691 7.4388 5.5115 5.1569 7.8349 2.0469 2.9902 3.6949 2.7555 6.6169 2.5208 2.6327 2.2697 6.3813 4.2304 2.0893 3.2695 2.8315 3.6441 5.0561 4.9048 2.7382 4.4923 5.7099 4.4177 9.1954 4.2421 2.9743 1.7653 2.2294 3.6864 4.2087 3.5200 5.6871 1.6433 1.4690 2.4882 1.3880 2.6517 3.3737 4.6385 2.8940 2.2080 2.1406 1.9444 3.5877 1.5203 3.7129 1.9794 3.0529 2.3735 2.5388 1.1410 2.0351 2.5768 1.0946 1.3187 1.6629 1.9562 1.5316 1.2529 1.2039 1.2635 1.3415 1.2859 1.3162 1.3112 1.3312 1.6457 1.2933 2.3333 1.5692 1.3164 3.4540 1.0811 1.0779 1.0961 3.1482 1.1035 1.0524 1.2097 1.0460 8.9045 9.4518 1.0702 1.0692 1.0821 1.0672 1.0781 1.0734 1.0369 1.0612 1.0912 1.0910 1.0950 1.0968 1.0998 1.0978 1.1101 1.0629 1.0924 1.0936
irintensity: 0.4448 0.2574 0.7449 1.7495 9.9776 4.6369 1.7288 3.5097 4.0870 1.3328 2.2644 0.8827 3.4086 0.2639 2.0849 0.3918 0.9789 19.3795 1.1097 0.1211 2.2146 5.8630 11.2393 0.4933 3.2404 11.8132 3.5710 14.7165 5.3154 15.8080 3.3703 1.0539 0.9073 17.3853 27.5730 44.2868 10.4809 33.6035 6.3282 33.2547 1.0443 20.9286 17.5425 29.7074 24.2471 48.0497 162.8335 42.0885 9.9778 1.4166 15.4430 58.7081 10.9270 37.3083 19.9338 50.3040 1.0913 33.4014 4.7359 43.6720 23.7696 0.8495 1.4883 24.1286 97.7142 67.2707 9.7389 4.9493 5.1668 18.4303 1.9282 5.1355 10.0780 3.5323 53.7329 3.7604 63.7067 59.2201 18.6184 60.4552 3.0288 1.3144 21.1929 223.1499 14.9811 7.8247 16.6099 11.5959 2.7131 1.9503 58.8777 58.8028 24.8509 31.1882 21.1568 119.5825 14.9784 134.1648 27.7197 22.1091 39.2674 38.7486 21.0572 22.5373 28.7728 311.8263 4.6001 2.9230
temp: 298.150 k
press: 1.00000 atm
elementType: 35 8 8 8 8 7 6 6 6 6 6 6 6 6 6 6 6 6 6 6 1 1 1 1 1 1 1 1 1 1 1 1 1 1 1 1 1 1
symmnumber: 1
zpe: 793792.4 jmol-1
zpe.correction: 0.302340 hartree
zpe.thermalcorrener: 0.321278 hartree
zpe.thermalcorrenthalpy: 0.322222 hartree
zpe.thermalcorrgfe: 0.253368 hartree
zpe.sumelectzpe: -911.807045 hartree
zpe.sumelectthermal: -911.788107 hartree
zpe.sumelectthermalent: -911.787163 hartree
zpe.sumelectthermalfe: -911.856017 hartree
dipole: 0.4256 -0.7037 1.5348
dipole: 1.7413
quadrupole: -124.6421 -127.3432 -128.4710
quadrupole: -4.3555 -2.8838 -5.1034
quadrupole: 2.1767 -0.5244 -1.6523 -4.3555 -2.8838 -5.1034
hfenergy: -912.1093849 hartree
pointgroup: C01 [X(C14H18Br1N1O4)]
dipole: -0.1807456 0.3894856 0.5338016 debye
polarizability: 252.8301038|-21.2133457|186.1182313|1.3939083|-16.2728118|125.5067892 unknown
InChI: InChI=1S/C14H18BrNO4/c1-9(16-2-4-18-5-3-16)14(17)10-6-12-13(7-11(10)15)20-8-19-12/h6-7,9,14,17H,2-5,8H2,1H3
charge 0 multiplicity 1
38 atoms
Br -0.688003 -3.057165 0.728143
O  5.701405 0.193492 -0.173771
O  0.856016 0.757429 -1.535217
O  -4.023699 1.894576 -0.688036
O  -5.131348 0.008404 0.29964
N  2.800868 0.24376 0.152612
C  1.42782 -0.065937 0.700126
C  0.528755 -0.302209 -0.587241
C  3.527243 -0.997385 -0.259914
C  3.693679 1.086057 0.998738
C  0.866954 1.060433 1.583738
C  4.821237 -0.640055 -1.006768
C  4.982625 1.413002 0.224725
C  -0.969926 -0.301849 -0.319825
C  -1.723457 0.855263 -0.68191
C  -1.655467 -1.400705 0.252532
C  -3.094085 0.851025 -0.441009
C  -3.749025 -0.255292 0.140551
C  -3.053929 -1.409379 0.503076
C  -5.355751 1.292372 -0.423788
H  1.452148 -1.006126 1.29278
H  0.798308 -1.290936 -1.018075
H  2.879559 -1.598152 -0.922851
H  3.773599 -1.617683 0.633566
H  3.959907 0.56719 1.949793
H  3.184949 2.031299 1.250374
H  -0.135468 0.776088 1.943957
H  1.496552 1.237039 2.47251
H  0.765434 2.005699 1.02014
H  5.404357 -1.545741 -1.240647
H  4.57579 -0.103556 -1.949253
H  4.731737 2.012962 -0.677617
H  5.686117 1.977601 0.858528
H  -1.198059 1.685749 -1.157027
H  1.828757 0.942292 -1.305234
H  -3.556531 -2.270631 0.946311
H  -5.935295 1.968965 0.222029
H  -5.853772 1.076301 -1.387887
