program: Gaussian 09
title: 000236670
version: EM64L-G09RevD.01
frameworkgroup: C1[X(C14H10ClNOS)]
method: RPBEPBE
basis: SDD
operation: Freq
keyword: #p
keyword: freq=noraman
keyword: PBEPBE/SDD
title: #p freq=noraman PBEPBE/SDD
converged: YES YES NO NO
title: Mulliken charges:
elementType: Cl S O N C C C C C C C C C C C C C C H H H H H H H H H H
charge: -0.066474 0.254054 -0.222287 -0.430870 -0.740314 0.657594 0.201157 0.561902 -0.341641 -0.361812 -0.317851 -0.394426 -0.262858 -0.208250 -0.241973 -0.227585 -0.249185 -0.225489 0.344189 0.329884 0.259549 0.236377 0.248645 0.233693 0.235337 0.257754 0.234339 0.236543
chargesum: 0.00000
title: Mulliken charges with hydrogens summed into heavy atoms:
elementType: Cl S O N C C C C C C C C C C C C C C
charge: -0.066474 0.254054 -0.222287 -0.100986 -0.396124 0.657594 0.201157 0.561902 -0.341641 -0.361812 -0.058302 -0.158049 -0.014213 0.025442 -0.006636 0.030168 -0.014846 0.011054
polarizability: 2.84655004e+02 -2.69388242e+01 1.60584107e+02 -1.38043796e+01 -5.08873300e+00 1.24165256e+02
1716.lowfreq: -9.9527 -7.5492 -0.0024 -0.0019 -0.0015 5.0178 24.4143 38.0904 63.7202
frequency: 24.3497 38.0133 63.7146 92.4200 134.3755 148.9524 159.4798 195.1301 260.5535 272.7554 292.2912 313.3406 372.3345 383.3802 405.1060 431.8646 451.0633 460.9138 503.6440 534.9661 538.2114 545.2411 634.6779 641.7321 669.5553 679.4970 691.6538 713.9766 724.5853 748.6861 759.4837 778.9316 827.8934 856.8464 866.6682 877.7541 923.4127 940.1902 951.8517 978.4467 988.0811 1014.8870 1029.5686 1042.7216 1052.4508 1125.5318 1129.3843 1172.6541 1173.0699 1183.7729 1206.7677 1215.8106 1260.1635 1269.9819 1292.0694 1336.9800 1370.2410 1381.7912 1405.2428 1427.2943 1457.9739 1468.9917 1473.1511 1575.4291 1586.0682 1598.5111 1608.4486 1621.1167 3031.5487 3126.2343 3140.2848 3141.1854 3153.3977 3156.2878 3171.4562 3172.6446 3179.7445 3515.1597
redmass: 7.9264 7.2762 5.7587 7.0783 11.1766 5.0977 5.8390 7.1238 5.3049 5.8946 7.0775 6.6716 8.3502 7.4247 11.1071 4.8520 3.3188 4.9015 4.6990 3.3645 5.4954 3.7214 6.3708 5.7631 5.4541 1.8875 6.1610 3.5095 3.3069 1.6078 1.3530 2.3815 4.9988 1.5645 1.5230 3.6349 4.1610 1.3928 1.4400 1.3272 1.3414 6.4744 3.3296 2.0626 3.0326 1.7325 1.5877 1.0747 1.0662 1.1224 1.5569 2.7958 1.6884 1.9612 1.4116 3.3082 4.2447 5.4389 2.2703 2.1846 2.4728 2.5775 2.6627 6.0256 7.1120 6.3865 7.0789 5.2592 1.0836 1.0881 1.0862 1.0879 1.0941 1.0911 1.0949 1.1007 1.1000 1.0758
irintensity: 0.6216 0.9250 1.8731 0.5677 1.9416 0.1536 0.5812 3.5072 2.8858 1.3032 0.5886 5.2575 6.8940 1.0714 3.9579 3.6016 13.3983 7.2909 6.7548 6.9225 20.0804 4.3078 3.3588 12.3858 13.5826 57.7716 7.3831 16.7583 2.9381 54.6200 114.4485 24.7387 2.9543 2.3227 3.9963 14.2775 0.9951 3.0870 0.4246 0.1257 0.4537 39.7087 13.8996 3.2881 11.7076 3.3509 7.4112 0.8240 0.3457 3.3360 12.5432 60.7015 2.9885 64.1800 1.8797 120.9955 10.2520 2.1299 5.3378 23.9598 9.0162 24.6340 101.1724 10.8562 39.9744 43.3469 10.2245 306.9232 6.9528 6.0560 1.9335 1.7386 14.8860 17.6193 7.9941 24.3789 9.6998 32.6711
temp: 298.150 k
press: 1.00000 atm
elementType: 17 16 8 7 6 6 6 6 6 6 6 6 6 6 6 6 6 6 1 1 1 1 1 1 1 1 1 1
symmnumber: 1
zpe: 533199.8 jmol-1
zpe.correction: 0.203085 hartree
zpe.thermalcorrener: 0.218039 hartree
zpe.thermalcorrenthalpy: 0.218984 hartree
zpe.thermalcorrgfe: 0.159441 hartree
zpe.sumelectzpe: -1526.359427 hartree
zpe.sumelectthermal: -1526.344473 hartree
zpe.sumelectthermalent: -1526.343528 hartree
zpe.sumelectthermalfe: -1526.403071 hartree
dipole: 1.9500 -0.3065 0.5779
dipole: 2.0568
quadrupole: -90.9958 -120.9102 -119.8148
quadrupole: 1.2596 -8.6453 0.0633
quadrupole: 19.5778 -10.3366 -9.2412 1.2596 -8.6453 0.0633
hfenergy: -1526.562512 hartree
pointgroup: C01 [X(C14H10Cl1N1O1S1)]
dipole: 0.7691349 -0.1876819 0.1674112 debye
polarizability: 286.5815507|-14.680882|156.545043|-21.0694273|10.4101008|126.2777734 unknown
InChI: InChI=1S/C14H10ClNOS/c15-10-6-2-1-5-9(10)13-14(17)16-11-7-3-4-8-12(11)18-13/h1-8,13,16H
charge 0 multiplicity 1
28 atoms
Cl -1.975969 -1.652236 -2.227269
S  0.502652 -1.013099 1.099527
O  -0.579176 2.598493 0.07417
N  1.531752 1.665078 -0.015065
C  -0.416392 0.135469 -0.150787
C  -1.899771 -0.005577 0.068538
C  0.138568 1.560616 0.001404
C  2.498936 0.624575 -0.025289
C  2.182296 -0.673956 0.461305
C  -2.711815 -0.797101 -0.780005
C  -2.539805 0.620989 1.172046
C  3.817749 0.899229 -0.468401
C  3.177019 -1.675347 0.500572
C  4.811515 -0.098626 -0.407701
C  4.494137 -1.38879 0.078214
C  -4.092748 -0.969366 -0.569805
C  -3.919809 0.461253 1.406728
C  -4.699534 -0.333537 0.535703
H  -0.132652 -0.249914 -1.146446
H  1.873241 2.630924 -0.037835
H  -1.941265 1.251952 1.835177
H  4.058387 1.895778 -0.857959
H  2.918058 -2.675549 0.863284
H  5.827628 0.127936 -0.746721
H  5.260805 -2.168922 0.119142
H  -4.67837 -1.5882 -1.255001
H  -4.387169 0.959023 2.262371
H  -5.773271 -0.461091 0.709002
