program: Gaussian 09
title: 000236667
version: EM64L-G09RevD.01
frameworkgroup: C1[X(C13H16N4O4S)]
method: RPBEPBE
basis: SDD
operation: Freq
keyword: #p
keyword: freq=noraman
keyword: PBEPBE/SDD
title: #p freq=noraman PBEPBE/SDD
converged: YES YES NO NO
title: Mulliken charges:
elementType: S O O O O N N N N C C C C C C C C C C C C C H H H H H H H H H H H H H H H H
charge: 0.279859 -0.254028 -0.451794 -0.476197 -0.437163 -0.173835 -0.095624 -0.035042 0.013314 -0.157917 -0.113055 -0.135471 -0.073466 -0.396507 0.148831 -0.218542 0.145709 -0.378352 -0.378139 -0.775344 0.038293 -0.557106 0.270742 0.282981 0.284399 0.240179 0.224563 0.265660 0.357886 0.358353 0.322129 0.342709 0.249908 0.262527 0.342290 0.239218 0.220706 0.217325
chargesum: 0.00000
title: Mulliken charges with hydrogens summed into heavy atoms:
elementType: S O O O O N N N N C C C C C C C C C C C C C
charge: 0.279859 -0.254028 -0.093908 -0.117844 -0.094453 -0.173835 -0.095624 -0.035042 0.013314 0.112825 0.169926 0.148928 0.166713 0.093717 0.148831 0.103586 0.145709 -0.378352 -0.128230 -0.170528 0.277511 -0.119075
polarizability: 2.96835500e+02 -2.25661779e+01 2.16101411e+02 3.82145557e+00 -6.19699349e+00 1.20430505e+02
1716.lowfreq: -9.2796 -4.4256 -0.0005 0.0012 0.0015 1.9246 4.9607 22.3838 32.3240
frequency: -3.7422 22.3193 32.2072 39.0243 49.7163 78.0022 87.8628 107.5809 121.1441 125.1499 160.9220 188.9292 199.1330 222.9875 228.7258 239.3614 255.9992 261.1904 273.3052 293.1607 298.0010 308.1565 342.2792 377.2856 381.7666 416.3199 423.6482 457.0755 526.1348 530.1276 538.9893 563.8436 605.8702 628.8815 646.5364 655.6573 700.8016 708.4539 743.2141 789.2998 793.5608 818.6351 846.9790 882.0647 884.3639 888.6364 916.1589 922.8620 925.8376 943.5325 945.2938 947.5484 967.6853 995.9016 1004.1004 1016.0572 1024.9024 1050.5117 1075.3867 1088.1282 1103.9343 1109.2963 1146.7019 1156.8343 1169.0326 1180.7307 1201.9506 1222.0927 1249.3718 1258.4145 1260.0587 1273.2968 1285.5229 1291.5718 1294.2903 1295.7846 1306.4689 1314.3123 1331.1959 1344.2802 1362.8987 1374.0230 1383.7792 1390.6695 1411.6985 1420.7759 1444.0960 1462.9577 1474.6349 1510.2560 1537.0099 1648.5883 3005.7287 3007.6894 3010.3260 3031.9476 3032.6916 3052.7065 3089.4605 3098.8676 3110.6526 3117.3938 3174.1857 3201.2371 3229.2707 3569.0677 3571.6000 3588.4758
redmass: 4.5194 5.3677 5.9230 5.7842 7.2982 2.7235 5.2565 5.7074 5.3065 5.0624 5.3893 4.5585 6.0804 4.6964 2.8008 4.6496 4.8647 1.5703 2.8253 1.2416 1.1640 3.9998 3.9431 4.9874 4.1276 2.9456 4.4677 5.6330 5.2377 4.8302 5.2491 3.1787 9.8693 7.4071 6.9785 6.1990 2.1282 7.2402 4.6279 7.0057 9.6705 9.2280 2.4445 2.5921 1.5165 1.7215 3.4930 1.4312 2.8647 2.4082 1.7899 2.1657 4.8813 3.6478 1.1520 3.7144 4.7417 1.6321 2.0141 3.9400 2.5465 2.0289 1.3941 1.5624 3.7383 1.2124 1.8614 1.3373 1.2874 1.8575 1.5531 1.2419 1.8343 1.6495 1.8133 3.2247 1.6835 1.3917 1.3118 1.3638 6.3474 1.2313 1.4445 1.6691 1.5619 1.1657 3.7498 1.1306 1.0754 8.7766 10.1771 4.4984 1.0617 1.0667 1.0843 1.0857 1.0874 1.0880 1.0611 1.1015 1.1020 1.0967 1.0924 1.1145 1.1011 1.0667 1.0666 1.0666
irintensity: 0.0478 0.3031 0.0030 0.3190 0.0689 3.0955 3.8377 0.3976 4.5468 1.8109 0.7877 7.3870 2.0004 10.0201 7.5968 11.6282 1.8801 85.1375 5.0604 232.3932 121.0871 37.8128 28.7757 6.9519 8.1984 6.7657 4.7174 1.2346 18.8879 2.5324 4.0720 15.1761 0.6975 4.9138 12.7922 12.0171 26.4281 20.4156 20.2941 120.1690 3.8483 16.9251 46.0241 22.1787 13.6917 26.9765 58.5295 10.6430 4.1833 5.9129 68.1276 38.0672 146.6587 149.7689 10.2582 69.8317 208.0570 37.2889 4.1891 7.5799 35.1945 18.4923 27.1540 29.0004 84.6337 23.2271 221.7350 1.5502 8.6773 11.4482 3.8007 12.6900 34.4103 23.7150 19.1684 65.9183 10.8041 9.4460 12.3342 26.2031 50.2099 4.6241 19.3740 51.8303 0.5644 6.1002 31.7007 13.0808 10.5499 369.0216 76.1362 11.3970 81.9040 37.5808 34.1569 10.0988 17.1360 10.9650 12.4799 12.1347 7.6276 14.9004 18.9926 25.2778 45.9683 10.0129 15.7126 15.8345
temp: 298.150 k
press: 1.00000 atm
elementType: 16 8 8 8 8 7 7 7 7 6 6 6 6 6 6 6 6 6 6 6 6 6 1 1 1 1 1 1 1 1 1 1 1 1 1 1 1 1
symmnumber: 1
zpe: 751703.7 jmol-1
zpe.correction: 0.286309 hartree
zpe.thermalcorrener: 0.307155 hartree
zpe.thermalcorrenthalpy: 0.308099 hartree
zpe.thermalcorrgfe: 0.235143 hartree
zpe.sumelectzpe: -1421.233538 hartree
zpe.sumelectthermal: -1421.212692 hartree
zpe.sumelectthermalent: -1421.211748 hartree
zpe.sumelectthermalfe: -1421.284704 hartree
dipole: -4.5182 -3.4688 0.6799
dipole: 5.7367
quadrupole: -146.0422 -126.9066 -132.1453
quadrupole: -1.3666 6.0696 7.0334
quadrupole: -11.0108 8.1248 2.8860 -1.3666 6.0696 7.0334
hfenergy: -1421.5198473 hartree
pointgroup: C01 [X(C13H16N4O4S1)]
dipole: 1.7525113 -1.22151 -0.7284033 debye
polarizability: 297.1057851|13.2329741|194.7644865|19.8896441|39.1867579|141.4971444 unknown
InChI: InChI=1S/C13H16N4O4S/c1-2-3-22-12-8-11(14-5-15-12)17(6-16-8)13-10(20)9(19)7(4-18)21-13/h2,5-7,9-10,13,18-20H,1,3-4H2
charge 0 multiplicity 1
38 atoms
S  -4.644753 0.819899 0.070313
O  2.421205 -0.538607 1.323056
O  3.951813 1.6577 -0.456428
O  2.690076 -1.489941 -1.719138
O  5.959101 -1.719098 0.791114
N  0.511089 0.388065 0.174336
N  -1.421136 -0.526679 -0.648967
N  -0.431564 2.262731 1.476771
N  -2.873494 2.34487 1.346782
C  2.870426 0.704093 -0.715269
C  1.924689 0.586533 0.519405
C  3.541046 -0.681385 -0.829467
C  3.551083 -1.211913 0.621955
C  4.871616 -0.901906 1.357375
C  -0.535631 1.170052 0.679151
C  -0.082531 -0.614787 -0.611091
C  -1.738671 0.592107 0.157423
C  -2.946128 1.244828 0.534433
C  -1.657038 2.795256 1.770528
C  -4.513485 -0.777496 -1.008625
C  -5.180722 -1.925331 -0.308116
C  -6.312822 -2.533972 -0.747449
H  2.313796 0.951196 -1.637967
H  1.946886 1.499092 1.1434
H  4.564356 -0.583244 -1.232817
H  3.340195 -2.298485 0.654594
H  4.739785 -1.074726 2.44288
H  5.168798 0.14449 1.188073
H  3.58961 2.579257 -0.439627
H  3.174189 -2.314502 -1.971653
H  0.525334 -1.353859 -1.128812
H  5.913188 -2.63359 1.167641
H  -1.666996 3.67878 2.41442
H  -5.008659 -0.521386 -1.958579
H  -3.436219 -0.949631 -1.171272
H  -4.690757 -2.278298 0.609939
H  -6.750499 -3.384419 -0.213537
H  -6.829174 -2.199396 -1.655975
