program: Gaussian 09
title: 000236666
version: EM64L-G09RevD.01
frameworkgroup: C1[X(C19H28O2)]
method: RPBEPBE
basis: SDD
operation: Freq
keyword: #pfreq=noraman
keyword: PBEPBE/SDD
title: #p freq=noraman PBEPBE/SDD
converged: YES YES NO NO
title: Mulliken charges:
elementType: O O C C C C C C C C C C C C C C C C C C C H H H H H H H H H H H H H H H H H H H H H H H H H H H H
charge: -0.442124 -0.223363 -0.171096 -0.101196 0.384127 -0.109640 0.264190 -0.519703 -0.529104 -0.194728 -0.538263 -0.504802 -0.060040 -0.459748 -0.478390 -0.797717 -0.821612 -0.132508 -0.609796 -0.366645 0.136071 0.211017 0.237960 0.204120 0.201148 0.197293 0.224920 0.199568 0.203161 0.214887 0.225945 0.221163 0.203105 0.217821 0.238936 0.216867 0.201499 0.207758 0.213662 0.233654 0.227444 0.236500 0.229059 0.229657 0.223049 0.236187 0.244307 0.331442 0.243959
chargesum: 0.00000
title: Mulliken charges with hydrogens summed into heavy atoms:
elementType: O O C C C C C C C C C C C C C C C C C C C
charge: -0.110682 -0.223363 0.039921 0.136765 0.384127 0.094480 0.264190 -0.121261 -0.104616 0.008433 -0.097431 -0.080534 0.157781 -0.003946 -0.069133 -0.122957 -0.126396 0.090541 -0.129302 -0.122686 0.136071
polarizability: 2.60302680e+02 3.22816632e+00 1.86592083e+02 -7.86707016e+00 2.17910735e+00 1.52618932e+02
1716.lowfreq: -9.8552 -1.3983 -0.0004 0.0003 0.0005 12.1935 35.7288 61.5519 76.4848
frequency: 35.5846 61.3980 76.4016 100.6942 123.7187 134.1857 168.4740 180.0144 196.7602 210.9809 219.2977 242.9921 251.6435 254.0516 283.9955 290.5348 294.6189 307.9733 332.9221 356.6982 365.5235 385.3394 410.8461 414.8063 435.3876 447.7730 475.1674 493.5856 528.2818 535.3837 537.1955 563.7265 597.7965 618.7328 637.9360 687.1690 710.9813 739.7950 784.6557 805.1296 814.6257 827.0823 833.0733 848.4725 891.9535 899.9671 915.1129 929.5260 933.4997 947.8702 958.8270 982.6772 995.1625 999.2421 1002.5284 1006.1472 1014.2295 1031.4138 1034.6878 1058.3412 1067.6748 1084.3430 1091.3757 1105.8833 1113.0166 1119.9451 1128.9630 1133.4745 1146.5261 1160.1506 1170.5702 1192.0867 1198.9196 1206.9750 1213.0609 1223.5558 1232.0379 1240.5431 1244.9978 1258.6369 1265.2469 1270.6818 1274.6793 1284.1681 1290.4525 1301.0758 1306.0685 1322.8196 1324.6754 1331.1741 1334.9617 1341.9829 1343.6726 1350.5321 1357.8495 1365.0762 1378.1459 1380.4743 1392.0619 1393.6649 1439.4476 1455.9934 1464.0149 1464.9377 1467.6054 1471.4871 1475.2964 1479.0356 1488.2519 1490.6308 1490.7501 1582.3850 1619.3980 2896.8600 2920.3209 2922.3697 2938.5270 2945.1331 2949.5783 2968.3071 2970.6588 2977.1921 2984.7497 2992.4015 2993.5029 2994.5388 3005.6393 3020.7977 3021.6540 3031.4682 3040.7502 3046.8732 3052.4529 3081.0629 3082.3704 3083.7140 3089.1521 3090.1280 3097.9233 3141.0818 3555.1669
redmass: 5.6222 3.6223 4.0788 1.9056 4.4511 1.9704 1.3607 2.2985 1.7234 3.3780 2.6927 3.2201 2.5214 2.1929 2.1816 1.6216 1.9295 2.2742 3.6414 2.2777 2.5933 2.6969 3.0544 3.6677 3.6045 3.6594 2.4186 4.0157 2.7704 3.0559 2.3930 3.2465 2.5421 2.9800 3.3981 3.6928 2.3251 3.0156 1.7773 2.1008 2.5640 2.0946 1.5672 2.0490 1.9028 1.8436 1.7984 2.0173 2.0059 2.0140 2.1047 2.3050 1.7050 1.7376 1.8710 2.3088 2.5025 1.8497 2.1139 2.1722 2.7567 1.9538 1.5844 2.1596 1.9253 2.3210 1.5105 2.0501 2.0502 1.7642 1.4877 1.6667 2.0900 1.4235 1.6465 1.8693 1.2606 1.3885 1.3736 1.4427 2.0914 1.5267 1.5596 1.3911 1.3932 1.3690 1.4193 1.3745 1.4246 1.3834 1.3602 1.4765 1.5077 1.4567 1.4221 1.5299 1.3508 1.4495 1.3305 1.2332 1.0825 1.0782 1.0837 1.0799 1.0758 1.0796 1.0766 1.0625 1.0584 1.0762 1.0671 9.9538 7.4090 1.0807 1.0817 1.0835 1.0813 1.0597 1.0664 1.0793 1.0624 1.0633 1.0627 1.0491 1.0403 1.0487 1.0922 1.0656 1.0933 1.1009 1.1011 1.0956 1.1013 1.1009 1.0983 1.1005 1.0991 1.0988 1.0860 1.0965 1.0660
irintensity: 3.4607 1.3155 2.0745 0.9391 1.0816 1.3226 0.0699 1.2394 1.7480 3.6942 0.2005 0.5511 5.4169 0.3222 10.8302 68.8528 61.0937 17.2608 6.3468 0.5763 1.9632 4.3155 0.8637 1.4185 7.3866 6.1046 0.5809 12.5772 1.8480 1.8569 1.1499 1.0398 1.3071 2.2578 0.4704 0.4200 0.9450 2.3672 22.1671 2.5736 10.5317 3.3250 7.3338 1.3829 3.2758 3.7409 13.7290 21.8020 3.5378 6.9967 18.0537 11.2696 15.8348 1.8865 8.2961 66.7797 3.9576 3.6994 11.4727 5.3334 0.9516 3.8479 1.1491 6.2765 10.9821 9.9043 7.4552 2.5225 6.8909 16.8354 17.1568 5.2040 8.8936 3.6365 7.2550 16.5148 24.0886 0.4085 3.2597 0.0445 37.8227 0.5816 1.1709 2.1503 9.0647 10.9596 0.8591 1.0081 3.4859 1.5496 5.1980 0.3470 1.6306 0.3402 0.5588 0.4719 11.7114 5.4755 10.3961 27.2165 8.8125 4.2867 12.2549 13.5186 12.2478 10.6400 1.2237 1.5886 5.5954 13.3626 9.3679 147.4255 124.7807 4.0930 0.7355 59.6295 14.7074 58.4451 18.3887 38.9302 19.7903 33.8440 17.4845 16.3856 14.0439 37.3871 69.8485 23.1621 49.7926 48.3467 66.0622 27.5702 16.2461 40.9081 25.6357 37.5591 39.1034 22.6319 14.0963 19.6357 5.0391
temp: 298.150 k
press: 1.00000 atm
elementType: 8 8 6 6 6 6 6 6 6 6 6 6 6 6 6 6 6 6 6 6 6 1 1 1 1 1 1 1 1 1 1 1 1 1 1 1 1 1 1 1 1 1 1 1 1 1 1 1 1
symmnumber: 1
zpe: 1127171.7 jmol-1
zpe.correction: 0.429317 hartree
zpe.thermalcorrener: 0.449048 hartree
zpe.thermalcorrenthalpy: 0.449992 hartree
zpe.thermalcorrgfe: 0.383289 hartree
zpe.sumelectzpe: -889.628931 hartree
zpe.sumelectthermal: -889.609201 hartree
zpe.sumelectthermalent: -889.608256 hartree
zpe.sumelectthermalfe: -889.674959 hartree
dipole: -3.2374 -0.6481 0.3096
dipole: 3.3161
quadrupole: -180.9832 -119.2260 -126.3323
quadrupole: 3.5132 9.4790 1.7491
quadrupole: -38.8027 22.9545 15.8482 3.5132 9.4790 1.7491
hfenergy: -890.0582484 hartree
pointgroup: C01 [X(C19H28O2)]
dipole: -1.2703763 -0.2715529 0.1206319 debye
polarizability: 260.2116385|4.1894868|186.6704808|-7.8609241|2.201677|152.6315757 unknown
InChI: InChI=1S/C19H28O2/c1-18-9-7-13(20)11-12(18)3-4-14-15-5-6-17(21)19(15,2)10-8-16(14)18/h7,9,12,14-17,21H,3-6,8,10-11H2,1-2H3
charge 0 multiplicity 1
49 atoms
O  -5.315874 -1.095168 -0.279495
O  5.846621 -0.071488 -0.676126
C  -2.037125 0.705094 -0.362823
C  -0.629001 0.798172 0.260047
C  -2.811514 -0.586047 0.043661
C  0.200845 -0.446597 -0.214984
C  1.688453 -0.399611 0.319128
C  -2.000122 -1.80616 -0.451123
C  -0.545439 -1.776913 0.096677
C  -4.150066 -0.314496 -0.716284
C  -3.062368 1.847981 -0.12451
C  0.071393 2.128245 -0.109545
C  2.321788 0.963189 -0.140109
C  -4.444377 1.190762 -0.463303
C  1.532875 2.179953 0.385934
C  -3.090574 -0.689092 1.56449
C  1.734749 -0.584156 1.870863
C  2.526674 -1.523803 -0.281057
C  3.832267 1.038273 0.173306
C  3.848652 -1.40363 -0.608191
C  4.60991 -0.147318 -0.40379
H  -1.884131 0.64061 -1.466901
H  -0.730742 0.76411 1.365602
H  0.270892 -0.364655 -1.325117
H  -1.96949 -1.79585 -1.562005
H  -2.481863 -2.758487 -0.147006
H  -0.568585 -1.947841 1.189633
H  0.003222 -2.633412 -0.339118
H  -3.968118 -0.496719 -1.800927
H  -2.854992 2.728788 -0.756843
H  -3.031126 2.190436 0.927296
H  -0.503833 2.977525 0.3065
H  0.060128 2.246709 -1.214491
H  2.224898 0.97382 -1.249388
H  -5.15525 1.266853 0.378376
H  -4.927564 1.655934 -1.339533
H  2.019308 3.112218 0.036524
H  1.561268 2.207511 1.494036
H  -2.166379 -0.838321 2.14831
H  -3.592248 0.213508 1.953654
H  -3.765112 -1.540664 1.764355
H  2.760463 -0.448878 2.254545
H  1.076804 0.135471 2.387752
H  1.414164 -1.601181 2.157255
H  2.040699 -2.500354 -0.413584
H  4.008232 1.062395 1.26878
H  4.27624 1.968389 -0.227291
H  -5.195976 -2.038206 -0.558363
H  4.416625 -2.248099 -1.017716
