program: Gaussian 09
title: 000236665
version: EM64L-G09RevD.01
frameworkgroup: C1[X(C21H32O2)]
method: RPBEPBE
basis: SDD
operation: Freq
keyword: #pfreq=noraman
keyword: PBEPBE/SDD
title: #p freq=noraman PBEPBE/SDD
converged: YES YES NO NO
title: Mulliken charges:
elementType: O O C C C C C C C C C C C C C C C C C C C C C H H H H H H H H H H H H H H H H H H H H H H H H H H H H H H H H
charge: -0.432974 -0.227199 -0.109750 -0.120294 -0.154224 0.431888 0.396390 -0.539319 -0.084096 -0.527363 -0.502211 -0.545507 -0.234912 -0.485085 -0.474032 -0.534488 -0.869105 -0.848124 -0.611139 -0.363960 0.334974 0.046000 -0.782868 0.237022 0.185683 0.213045 0.216090 0.222462 0.223627 0.195895 0.223038 0.215915 0.200020 0.216092 0.224554 0.244129 0.195366 0.200635 0.208207 0.225071 0.230927 0.228773 0.239125 0.224409 0.231455 0.221033 0.240118 0.219794 0.224511 0.216258 0.258420 0.329540 0.234119 0.235949 0.256116
chargesum: 0.00000
title: Mulliken charges with hydrogens summed into heavy atoms:
elementType: O O C C C C C C C C C C C C C C C C C C C C C
charge: -0.103434 -0.227199 0.127272 0.065389 0.058821 0.431888 0.396390 -0.100767 0.139531 -0.108430 -0.086276 -0.104861 0.009217 -0.089085 -0.040753 -0.074789 -0.174116 -0.167180 -0.170369 -0.105540 0.334974 0.046000 -0.056684
polarizability: 2.87900776e+02 6.02768634e+00 2.10979530e+02 5.11185969e-01 3.34066065e+00 1.66727490e+02
1716.lowfreq: -14.7964 -9.3277 0.0002 0.0006 0.0011 8.4304 31.7075 43.2182 65.6398
frequency: 31.5831 43.1813 65.5624 75.7922 95.3065 112.7171 138.6930 144.6025 157.1306 162.7987 186.1180 192.3239 211.9984 222.3722 229.0085 250.6330 263.0672 281.8460 295.8351 303.1867 309.5867 332.9119 355.3563 365.0864 380.5441 389.3437 396.8905 408.2280 438.8349 450.4440 464.7097 485.1208 516.0972 535.2308 540.2063 552.8122 567.3778 589.2358 597.6971 626.5126 662.8049 709.9856 725.4226 803.3325 805.2686 818.3142 826.4674 827.2509 848.5126 889.5531 900.1687 906.7605 909.6822 929.2645 941.2488 943.9889 962.0716 966.6930 984.1979 996.1371 1002.2336 1008.9539 1021.5390 1023.6536 1027.7932 1032.9576 1034.6453 1051.7080 1070.0952 1072.3537 1089.2575 1089.9030 1109.3064 1119.6951 1130.0783 1134.3790 1144.2485 1149.4359 1160.9197 1175.7047 1189.6822 1204.5319 1207.0414 1212.2148 1233.6746 1237.5790 1243.1223 1248.2320 1254.3510 1266.4258 1274.1454 1282.5186 1284.1907 1296.2438 1299.4003 1303.6911 1318.5389 1321.3492 1325.3347 1332.8987 1334.5713 1341.7833 1345.6473 1348.9471 1356.1334 1360.8932 1363.5012 1368.8821 1383.1104 1390.3278 1391.9933 1439.1663 1439.7080 1451.7341 1459.1872 1460.2261 1464.2864 1464.6459 1467.8229 1473.0294 1479.3227 1481.8367 1490.2759 1491.6219 1497.6537 1570.3781 1657.2600 2895.7475 2904.5212 2926.3593 2930.2486 2944.8945 2947.1641 2956.7877 2962.4715 2963.9376 2976.7517 2979.0412 2981.2830 2983.5840 2988.4915 2994.4803 2999.2958 3001.0835 3013.7471 3021.5618 3024.6015 3025.2442 3037.0872 3047.9341 3060.7711 3062.2609 3073.3214 3074.0368 3081.0589 3082.2654 3107.6773 3121.2545 3553.7893
redmass: 4.8300 3.7513 3.4192 4.0825 4.6866 2.4021 2.0986 1.0401 1.2742 3.0705 1.9535 3.3254 2.2228 2.3763 2.1572 2.6012 2.4054 2.7449 2.6683 2.5000 2.4780 1.1377 2.8311 2.6505 2.8075 2.7380 2.5111 2.8310 3.0801 3.4084 3.8501 2.5199 3.2887 2.4907 2.9811 2.9187 3.6284 2.5053 2.5796 3.2825 3.2562 2.3411 2.7036 2.2962 2.8878 1.6495 1.5928 1.9379 1.9242 1.9435 1.7261 1.7995 2.1959 1.9535 2.0799 2.0486 1.9839 1.7657 2.5816 1.8708 2.4172 2.0440 1.8054 1.8773 2.5950 2.7733 1.8950 1.9071 1.9605 2.1522 1.6910 1.8251 2.3014 2.2384 1.8981 1.6125 1.9294 1.8746 1.4674 1.4835 1.8420 1.6533 1.7716 1.4795 1.4699 1.6497 1.3984 1.4783 2.2905 1.3502 1.6587 1.6244 1.4016 1.4540 1.3978 1.3525 1.3597 1.4244 1.6220 1.3892 1.3780 1.4683 1.4712 1.5241 1.4049 1.9996 1.5655 1.2821 1.2222 1.2107 1.2330 1.0950 1.0919 1.0826 1.0759 1.0629 1.0809 1.0837 1.0784 1.0858 1.0759 1.0721 1.0620 1.0592 1.0617 6.9776 7.1739 1.0814 1.0797 1.0711 1.0758 1.0647 1.0665 1.0629 1.0662 1.0743 1.0408 1.0383 1.0573 1.0630 1.0424 1.0854 1.0654 1.0944 1.0971 1.0877 1.0966 1.0986 1.1016 1.0994 1.0985 1.0958 1.1002 1.0979 1.0967 1.0983 1.0901 1.0995 1.0655
irintensity: 0.9791 3.5832 1.8521 0.1773 1.2707 1.1404 0.2186 0.2262 0.1602 1.3243 2.7531 0.0375 3.1111 1.1038 0.0471 0.6918 0.5862 4.1678 0.1818 0.4017 1.1276 119.4326 12.9305 1.4088 8.0982 1.2142 3.1042 0.1702 3.4925 2.3568 2.3820 2.4269 1.6545 0.2973 2.7989 2.5786 9.8530 6.0332 11.8588 2.5958 2.6224 0.9342 0.8612 1.3636 1.0721 9.5718 1.4550 3.5177 8.7990 5.5555 12.5456 5.4253 7.5719 19.9616 7.3267 15.4073 14.7008 5.6534 7.1283 4.1519 58.5963 28.0939 2.0608 5.0411 13.4846 25.2842 9.1574 4.5556 12.7951 2.1109 6.0844 2.8106 0.9060 10.4065 2.6036 0.6908 9.4435 20.0619 1.1461 1.5626 6.1227 11.8828 7.9624 2.0105 65.1521 3.0160 0.8005 9.8084 106.4603 2.6258 8.1856 4.6504 1.7340 1.5027 1.4284 0.4268 1.3130 4.0648 7.3194 5.0306 0.1327 1.4541 0.9262 1.6834 0.4725 5.7048 7.7295 59.6939 23.9359 4.1173 43.1788 49.7834 7.8107 16.0850 2.0309 24.1315 10.5869 3.9460 16.8723 3.4262 7.4915 3.1380 0.0780 15.9723 5.7524 195.6673 53.2057 5.2658 22.4331 9.9708 19.6530 22.9403 20.8457 31.0054 63.3606 27.7315 22.6712 5.3068 15.2956 35.0048 17.8002 30.8957 37.7041 13.7772 67.5158 16.3823 30.2255 70.6559 70.2499 7.8685 35.9209 15.1813 62.5114 38.4208 33.0466 28.7168 4.4553 20.2151 6.8441
temp: 298.150 k
press: 1.00000 atm
elementType: 8 8 6 6 6 6 6 6 6 6 6 6 6 6 6 6 6 6 6 6 6 6 6 1 1 1 1 1 1 1 1 1 1 1 1 1 1 1 1 1 1 1 1 1 1 1 1 1 1 1 1 1 1 1 1
symmnumber: 1
zpe: 1271653.3 jmol-1
zpe.correction: 0.484347 hartree
zpe.thermalcorrener: 0.506991 hartree
zpe.thermalcorrenthalpy: 0.507935 hartree
zpe.thermalcorrgfe: 0.434573 hartree
zpe.sumelectzpe: -968.082200 hartree
zpe.sumelectthermal: -968.059556 hartree
zpe.sumelectthermalent: -968.058612 hartree
zpe.sumelectthermalfe: -968.131974 hartree
dipole: -2.0273 3.5970 1.3749
dipole: 4.3518
quadrupole: -178.7732 -142.9145 -138.1431
quadrupole: 8.0831 -4.0292 -2.2763
quadrupole: -25.4963 10.3625 15.1338 8.0831 -4.0292 -2.2763
hfenergy: -968.5665473 hartree
pointgroup: C01 [X(C21H32O2)]
dipole: -0.8096995 -1.4175636 -0.5160725 debye
polarizability: 287.8214261|-6.1047244|211.0450641|-2.7047515|3.1433607|166.7413067 unknown
InChI: InChI=1S/C21H32O2/c1-13(22)14-8-10-20(2)15(12-14)4-5-16-17-6-7-19(23)21(17,3)11-9-18(16)20/h8,15-19,23H,4-7,9-12H2,1-3H3
charge 0 multiplicity 1
55 atoms
O  -5.899117 1.183633 0.254372
O  6.186596 1.284827 0.195738
C  -1.239122 -0.822808 -0.207541
C  -0.419546 0.433394 0.24241
C  -2.662114 -0.721319 0.377359
C  -3.422327 0.571966 -0.0453
C  1.064339 0.407791 -0.28755
C  -1.165247 1.766447 -0.059421
C  1.733493 -0.92869 0.194179
C  -2.624414 1.789053 0.473064
C  -0.529209 -2.121461 0.245877
C  -3.679729 -1.864916 0.118001
C  -4.789864 0.313708 0.664132
C  0.93554 -2.181184 -0.234984
C  -5.066352 -1.213328 0.442567
C  1.865051 1.584243 0.352463
C  -3.656415 0.682843 -1.574663
C  1.136519 0.546542 -1.833047
C  3.215762 -1.036442 -0.241168
C  3.362791 1.413837 0.304691
C  4.002937 0.236647 0.027715
C  5.507698 0.233111 -0.011153
C  6.214653 -1.088434 -0.303736
H  -1.306997 -0.837119 -1.316348
H  -0.343234 0.357076 1.354467
H  -2.53764 -0.649934 1.484222
H  -1.176463 1.956251 -1.150084
H  -0.611109 2.610505 0.393722
H  1.719138 -0.893197 1.307464
H  -2.608205 1.761814 1.583318
H  -3.118763 2.736713 0.183176
H  -1.085436 -3.004707 -0.124025
H  -0.553092 -2.171974 1.356042
H  -3.48191 -2.751034 0.746138
H  -3.631612 -2.197653 -0.936739
H  -4.685091 0.539174 1.741398
H  1.430376 -3.087043 0.170309
H  0.962297 -2.281139 -1.339415
H  -5.780793 -1.346802 -0.39352
H  -5.539554 -1.659607 1.334135
H  1.558919 1.712012 1.415603
H  1.601745 2.542102 -0.140543
H  -2.71002 0.705642 -2.139607
H  -4.248875 -0.163032 -1.971594
H  -4.196543 1.620418 -1.804177
H  0.640654 1.474378 -2.169798
H  2.186332 0.599879 -2.172413
H  0.654502 -0.298022 -2.355608
H  3.271007 -1.296751 -1.320383
H  3.678475 -1.891776 0.290873
H  3.990519 2.2938 0.507115
H  -6.167281 0.938488 -0.667622
H  5.809771 -1.573323 -1.211247
H  6.069346 -1.798258 0.533707
H  7.292413 -0.903942 -0.430567
