program: Gaussian 09
title: 000236664
version: EM64L-G09RevD.01
frameworkgroup: C1[X(C11H12N2O2S)]
method: RPBEPBE
basis: SDD
operation: Freq
keyword: #p
keyword: freq=noraman
keyword: PBEPBE/SDD
title: #p freq=noraman PBEPBE/SDD
converged: YES YES NO NO
title: Mulliken charges:
elementType: S O O N N C C C C C C C C C C C H H H H H H H H H H H H
charge: 0.198760 -0.291336 -0.294340 -0.072268 -0.042636 0.535104 -0.080723 -0.536447 0.232082 0.230023 -0.446113 -0.276052 -0.352814 -0.529467 -0.527996 -0.843752 0.284917 0.286362 0.271144 0.226487 0.261780 0.236739 0.252248 0.237061 0.231699 0.261406 0.275466 0.272666
chargesum: 0.00000
title: Mulliken charges with hydrogens summed into heavy atoms:
elementType: S O O N N C C C C C C C C C C C
charge: 0.198760 -0.291336 -0.294340 -0.072268 -0.042636 0.535104 -0.080723 -0.251530 0.232082 0.230023 -0.159751 -0.276052 -0.081670 0.195538 0.193012 -0.034214
polarizability: 2.35061754e+02 -8.66228702e+00 1.74805453e+02 2.01853103e+00 2.94439018e+00 9.12051570e+01
1716.lowfreq: -6.9925 0.0012 0.0012 0.0019 3.5517 8.0814 43.3137 52.8365 65.2754
frequency: 43.3036 52.8174 65.2739 105.5817 112.5093 126.9462 132.6698 152.3653 160.1689 167.6238 195.0352 217.1003 242.2498 274.9305 315.6875 334.6931 362.9113 402.0108 425.6393 447.5316 489.4933 577.8319 583.8472 595.4088 637.6376 660.9112 671.3998 718.5903 746.7364 781.6244 826.3457 889.5579 898.0388 902.9028 912.9918 945.2131 956.5767 968.0133 989.1459 1039.0168 1090.5450 1111.4088 1114.3906 1132.2534 1146.6482 1151.3562 1176.3989 1195.7874 1214.7809 1271.8295 1329.1878 1342.2792 1365.7249 1414.6672 1425.5393 1439.0634 1444.6258 1459.1241 1460.9243 1461.5458 1471.5089 1476.1089 1486.6084 1501.1629 1521.3337 1620.7057 2978.3832 2981.9843 3013.3145 3076.9053 3083.4159 3129.1036 3132.0668 3135.9716 3141.1676 3158.9676 3174.1977 3178.7226
redmass: 3.3907 4.1209 3.6428 3.4789 2.9769 2.7447 1.3976 2.1710 1.1637 1.2399 4.0628 4.0965 5.1463 6.5836 7.4831 6.6112 6.9402 5.4016 7.9494 7.5111 3.6974 8.1404 5.1668 6.1488 7.1538 6.5925 7.5145 5.9968 4.1880 4.3455 5.8053 5.6236 1.5238 1.5287 1.4745 5.8862 6.5044 1.1809 1.2827 3.7948 5.1396 1.2465 1.2659 5.4205 1.4698 1.4830 2.4056 2.7522 1.4631 2.4906 4.1258 1.2154 3.4812 2.4753 1.2308 1.4209 1.0607 1.0628 1.1031 1.0599 4.1070 1.0626 1.0575 6.5879 8.6902 7.4062 1.0304 1.0312 1.0279 1.1049 1.1033 1.1029 1.1037 1.1052 1.1051 1.0917 1.0931 1.0927
irintensity: 1.3896 0.8854 1.4295 3.8821 6.6984 7.5812 2.4446 0.0757 0.2856 0.1169 2.0909 5.6978 6.8353 12.2445 4.9328 3.7364 1.7958 1.6602 2.9356 9.1330 4.3854 1.3873 3.5890 6.9306 2.0471 15.8788 3.0382 11.6106 14.9022 1.0703 0.5647 16.3979 0.9185 1.9949 65.0035 105.6746 23.5935 4.8181 19.2900 3.9578 69.6640 28.9098 8.5177 31.4361 13.7965 5.1259 71.3908 45.0514 10.2025 150.4322 56.4305 2.6039 19.1956 34.3708 0.4638 9.3866 17.7629 16.0607 24.5187 13.3266 182.6505 13.3079 31.3628 32.0566 12.4426 11.5522 71.0681 69.8800 24.7802 24.4852 20.7504 21.3741 16.7822 13.3979 8.0748 1.8216 2.4920 2.2993
temp: 298.150 k
press: 1.00000 atm
elementType: 16 8 8 7 7 6 6 6 6 6 6 6 6 6 6 6 1 1 1 1 1 1 1 1 1 1 1 1
symmnumber: 1
zpe: 551107.9 jmol-1
zpe.correction: 0.209906 hartree
zpe.thermalcorrener: 0.226132 hartree
zpe.thermalcorrenthalpy: 0.227076 hartree
zpe.thermalcorrgfe: 0.165650 hartree
zpe.sumelectzpe: -1083.130915 hartree
zpe.sumelectthermal: -1083.114689 hartree
zpe.sumelectthermalent: -1083.113745 hartree
zpe.sumelectthermalfe: -1083.175172 hartree
dipole: 3.3191 -4.9939 0.6439
dipole: 6.0308
quadrupole: -88.3827 -110.5702 -101.7040
quadrupole: 7.4036 -5.4442 -10.0776
quadrupole: 11.8363 -10.3512 -1.4851 7.4036 -5.4442 -10.0776
hfenergy: -1083.3408213 hartree
pointgroup: C01 [X(C11H12N2O2S1)]
dipole: -1.4137396 -1.8943561 -0.2060253 debye
polarizability: 235.5773179|5.3779722|173.4499698|6.7444186|-7.1495817|92.0450759 unknown
InChI: InChI=1S/C11H12N2O2S/c1-14-9-4-7-8(5-10(9)15-2)13-12-6-11(7)16-3/h4-6H,1-3H3
charge 0 multiplicity 1
28 atoms
S  3.197238 -1.681486 0.926673
O  -2.219439 -1.791346 0.374752
O  -3.12458 0.843322 -0.472902
N  1.429994 2.429888 -0.475377
N  2.751074 2.268659 -0.251911
C  1.011965 0.041463 0.181805
C  0.566031 1.349436 -0.265145
C  0.045162 -0.988806 0.380947
C  -1.308342 -0.746944 0.14239
C  -1.757233 0.573672 -0.26027
C  -0.828072 1.587165 -0.475681
C  2.426017 -0.099518 0.372106
C  3.231704 1.023497 0.157239
C  -3.048555 -2.198714 -0.789037
C  -3.96582 0.784677 0.750145
C  3.080308 -2.662444 -0.693218
H  0.356056 -1.977857 0.731271
H  -1.154478 2.584112 -0.783778
H  4.315155 0.983092 0.295905
H  -2.402476 -2.653694 -1.562616
H  -3.594019 -1.33649 -1.209512
H  -3.747916 -2.950237 -0.39421
H  -3.890964 -0.204971 1.235521
H  -4.993345 0.970391 0.404216
H  -3.655476 1.577467 1.455592
H  3.496693 -3.657557 -0.472318
H  3.678373 -2.165392 -1.470915
H  2.031048 -2.755083 -1.011373
