program: Gaussian 09
title: 000236662
version: EM64L-G09RevD.01
frameworkgroup: C1[X(C13H10O2S)]
method: RPBEPBE
basis: SDD
operation: Freq
keyword: #p
keyword: freq=noraman
keyword: PBEPBE/SDD
title: #p freq=noraman PBEPBE/SDD
converged: YES YES NO NO
title: Mulliken charges:
elementType: S O O C C C C C C C C C C C C C H H H H H H H H H H
charge: -0.003208 -0.311097 -0.243047 0.217178 0.388420 -0.304749 -0.399148 -0.330022 -0.329684 0.158553 -0.215066 -0.168601 -0.189498 -0.221090 -0.215936 -0.222011 0.307205 0.254804 0.269537 0.265665 0.227945 0.245723 0.234865 0.232576 0.234144 0.116543
chargesum: 0.00000
title: Mulliken charges with hydrogens summed into heavy atoms:
elementType: S O O C C C C C C C C C C C C C
charge: 0.113335 -0.311097 -0.243047 0.217178 0.388420 0.002456 -0.144344 -0.060485 -0.064019 0.158553 -0.215066 0.059344 0.056225 0.013775 0.016640 0.012133
polarizability: 3.08103285e+02 -3.10547462e+00 1.60777514e+02 -6.26031218e-02 9.56710134e-02 5.98851777e+01
1716.lowfreq: -8.5709 -1.0432 -0.0018 -0.0016 -0.0011 7.1897 24.3486 32.4244 62.6313
frequency: 24.0962 32.4162 62.6294 69.8791 122.1871 144.0003 173.0289 181.5772 226.0392 289.8935 335.2895 345.0548 402.8758 404.4572 407.4180 440.1460 464.9801 502.4740 612.8903 614.4256 627.2425 670.7243 681.3686 699.3831 704.2512 768.8569 793.8611 818.8591 823.5579 827.8968 863.8521 880.9912 951.2336 955.5785 965.9207 990.2813 996.2575 997.9053 1009.6628 1012.4410 1037.6784 1083.7948 1087.2650 1116.5810 1156.2956 1174.7112 1181.2916 1201.8087 1237.1498 1296.3020 1314.4055 1363.9585 1390.3537 1406.1677 1437.9309 1468.3675 1476.6411 1575.8144 1583.6225 1601.3467 1610.7224 1623.9391 2452.1738 3131.7493 3132.8707 3144.1151 3146.7271 3156.8348 3168.6295 3171.6224 3182.3843 3211.1661
redmass: 3.9130 7.1238 7.4228 6.4192 5.1810 1.1879 6.9395 4.8297 8.2434 5.5987 6.6308 5.9253 2.8247 9.8372 2.9689 3.7466 7.7374 2.7530 7.2713 6.7701 7.5704 5.1415 7.3020 1.6817 3.6451 9.1776 2.0821 6.9102 1.2621 1.5242 1.2453 1.1200 1.3464 1.4136 1.3363 6.2781 1.3860 3.9138 1.3315 4.5372 2.4178 2.0973 1.9440 1.3070 2.3210 1.0564 1.1361 1.5239 4.0380 1.2570 1.3212 5.8785 9.9681 3.8422 2.2426 2.2519 2.2940 7.3644 6.6917 6.5523 6.1469 10.5038 1.0383 1.0856 1.0914 1.0893 1.0889 1.0941 1.0983 1.0967 1.0970 1.0942
irintensity: 0.9434 0.3107 1.4347 0.9799 4.4546 26.0195 1.7553 0.4053 1.2153 4.5326 3.6198 5.5459 0.0000 10.5632 0.0311 0.0132 1.9150 27.5761 0.5056 0.5884 0.2102 18.9263 20.5053 78.8645 4.6059 8.8198 24.0233 1.8365 4.0348 82.8674 0.0010 14.2373 1.5924 6.8143 2.0649 7.9503 0.0431 23.6153 0.3792 234.4280 141.6353 24.9271 8.1652 17.1147 227.9351 0.0733 85.3760 177.0673 326.0191 4.0201 0.7456 13.5123 3.6400 7.6115 15.0196 178.3265 15.2887 0.8873 29.4511 3.2416 14.1531 144.7780 14.6611 0.0290 11.3905 10.5011 7.0725 16.6431 24.2599 4.1403 8.3141 5.4522
temp: 298.150 k
press: 1.00000 atm
elementType: 16 8 8 6 6 6 6 6 6 6 6 6 6 6 6 6 1 1 1 1 1 1 1 1 1 1
symmnumber: 1
zpe: 497768.0 jmol-1
zpe.correction: 0.189590 hartree
zpe.thermalcorrener: 0.203699 hartree
zpe.thermalcorrenthalpy: 0.204643 hartree
zpe.thermalcorrgfe: 0.146422 hartree
zpe.sumelectzpe: -1048.775366 hartree
zpe.sumelectthermal: -1048.761257 hartree
zpe.sumelectthermalent: -1048.760313 hartree
zpe.sumelectthermalfe: -1048.818534 hartree
dipole: 1.6430 -0.9304 0.0165
dipole: 1.8882
quadrupole: -82.1964 -91.5293 -106.7531
quadrupole: -9.5021 -0.1934 -0.0036
quadrupole: 11.2966 1.9637 -13.2602 -9.5021 -0.1934 -0.0036
hfenergy: -1048.964956 hartree
pointgroup: C01 [X(C13H10O2S1)]
dipole: -0.6556311 0.1034492 0.33365 debye
dipolederiv: -0.7792271 -0.0094474 0.0326459 0.0066343 -0.1039611 0.1262674 0.0911234 0.1285945 0.1314715 -2.2961059 -0.1963408 -0.2958302 -0.4203347 -0.2425672 -0.1460778 -0.8525172 -0.1662639 -0.5035991 -0.7968714 0.0637382 0.1991426 -0.1225943 -0.4028854 -0.2064686 -0.2626689 -0.2240973 -0.8424035 -0.6233814 0.0365872 0.1428761 0.0386579 -0.0279681 -0.0216868 0.1475685 -0.0216171 -0.0864179 1.3805595 0.0910472 0.1092049 0.0380529 0.0772995 -0.0123056 -0.0212243 -0.0177332 0.0405779 -0.1400271 -0.0108875 -0.0263785 -0.0094886 -0.1165427 0.0251392 -0.0199734 0.0258876 -0.0604498 -0.0669094 0.0012777 -0.0070281 -0.0049589 -0.1400031 0.0675507 -0.0231047 0.0672841 0.0040921 0.0835707 -0.0494326 -0.1391156 0.0607642 -0.0898328 0.043948 0.1334876 0.0534738 0.0115275 0.0521438 0.0304275 0.0619449 -0.0525134 -0.09751 0.0382372 -0.143351 0.0310846 -0.0216758 2.5103757 0.0479118 -0.0810386 0.4631676 0.4095049 0.3588675 0.9513409 0.3976165 1.1409525 1.2569218 0.0573261 0.0176918 0.008729 -0.093101 -0.0109261 -0.0967288 -0.0144694 -0.1097085 -0.436712 -0.0289231 -0.0471911 -0.102715 -0.1155057 0.0723924 -0.2225994 0.0638607 0.0430961 -0.3606793 -0.005733 0.009892 0.0752588 -0.0848286 0.0732855 0.2006583 0.0791701 0.0659069 -0.0312937 0.0757589 0.1777197 0.0963006 -0.1356319 0.0405037 0.2287437 0.0423456 -0.0698832 -0.2241524 -0.0339496 -0.0783191 -0.0502376 -0.1176858 0.1013132 -0.1184521 0.0998778 0.1012756 0.0887843 -0.0079155 -0.0382851 -0.0087455 -0.1102158 0.0598983 -0.0408306 0.0598337 0.0177835 0.1776188 -0.0173797 -0.0432523 -0.0109031 0.1668995 -0.0424913 -0.0296003 -0.0414044 0.0822145 0.0516334 0.0288512 0.0834654 0.0297712 0.1516123 -0.0549901 0.0862919 -0.0546282 0.0266616 0.1468004 0.0191796 0.048317 0.0066754 0.1340846 -0.0568717 0.0176206 -0.0579488 0.0113175 0.0740553 -0.0340844 -0.0781492 -0.0417645 0.1350508 -0.0417115 -0.0976627 -0.0424052 0.0565349 -0.0262704 0.0279008 0.0869268 0.0257965 0.1321757 -0.057933 0.081249 -0.0573309 0.0011475 0.0313466 -0.0359678 -0.0783053 -0.0320717 0.1347783 -0.0646188 -0.069589 -0.0635848 0.0057151 -0.0525827 -0.0409886 -0.0835161 -0.0480778 0.1346507 -0.0581973 -0.1013101 -0.0588644 0.0223456 0.0569508 0.0109822 0.0359791 0.0255277 0.1235735 -0.0903292 0.0719811 -0.0890804 -0.068146 -0.1161551 0.0139694 0.0579968 0.015754 0.1475436 -0.0265932 0.062381 -0.0264298 0.0868505 0.0396071 -0.0339079 -0.0673938 0.0133151 0.1310658 -0.1162021 0.0271664 -0.1131714 -0.0871871 unknown
polarizability: 307.889486|7.9878402|74.2264115|-2.1994933|34.8823987|146.6500785 unknown
InChI: InChI=1S/C13H10O2S/c14-13(10-4-2-1-3-5-10)15-11-6-8-12(16)9-7-11/h1-9,16H
charge 0 multiplicity 1
26 atoms
S  6.08413 0.389993 0.202951
O  0.01531 0.175718 0.227965
O  -0.570873 -0.697601 -1.879259
C  -2.302282 -0.107428 -0.268659
C  1.434302 0.170379 0.08507
C  2.155392 -0.255779 -1.054944
C  2.111139 0.650332 1.229899
C  -3.345046 -0.4985 -1.150218
C  -2.618912 0.400749 1.018801
C  -0.900588 -0.254221 -0.753834
C  4.254395 0.283716 0.110514
C  3.5667 -0.192855 -1.028451
C  3.516781 0.707396 1.24476
C  -4.69058 -0.382523 -0.748031
C  -3.967549 0.514742 1.416124
C  -5.004863 0.124407 0.535818
H  1.633189 -0.625532 -1.937184
H  1.528206 0.973479 2.097322
H  -3.077956 -0.887331 -2.138354
H  -1.810077 0.699209 1.690587
H  4.120283 -0.523426 -1.914877
H  4.033775 1.078831 2.135474
H  -5.492367 -0.684819 -1.430077
H  -4.211383 0.906734 2.409388
H  -6.05125 0.214561 0.84826
H  6.339723 -0.136832 -1.050645
