program: Gaussian 09
title: 000020758
version: EM64L-G09RevD.01
frameworkgroup: C1[X(C9H10O2)]
method: RPBEPBE
basis: SDD
operation: Freq
keyword: #pfreq=noraman
keyword: PBEPBE/SDD
title: #p freq=noraman PBEPBE/SDD
converged: YES YES NO NO
title: Mulliken charges:
elementType: O O C C C C C C C C C H H H H H H H H H H
charge: -0.452115 -0.464233 -0.099853 -0.334179 -0.561600 0.321128 0.280470 -0.402513 -0.408270 -0.229266 -0.223690 0.200097 0.225617 0.257921 0.222648 0.254333 0.241887 0.362297 0.357671 0.226310 0.225341
chargesum: 0.00000
title: Mulliken charges with hydrogens summed into heavy atoms:
elementType: O O C C C C C C C C C
charge: -0.089818 -0.106563 0.100244 -0.108562 -0.081031 0.321128 0.280470 -0.148180 -0.166383 -0.002956 0.001651
polarizability: 1.21736026e+02 5.28520685e-01 1.07034532e+02 -9.70584146e+00 8.82613375e-02 6.08000066e+01
1716.lowfreq: -3.3193 -0.0003 -0.0002 0.0006 3.6803 9.1355 73.5888 122.9168 179.2869
frequency: 73.5835 122.9083 179.2864 236.6061 274.1126 294.9260 356.9991 409.5634 451.8759 497.9751 509.5327 548.9909 572.3528 615.9228 710.2751 727.3448 747.8453 802.6095 825.7702 852.9919 881.7129 907.4784 946.9448 979.9041 988.1282 1006.6891 1020.8118 1041.7187 1085.4846 1147.3367 1153.9347 1168.2511 1179.5244 1185.8189 1225.9762 1258.4372 1268.1877 1305.1509 1329.2219 1357.2317 1366.1838 1392.5958 1442.9484 1449.4536 1475.4557 1599.5320 1621.7241 2964.6774 2980.7896 2999.5153 3068.7829 3122.2714 3133.9701 3146.8264 3162.6678 3427.5874 3573.2551
redmass: 5.9877 3.8522 3.9950 1.7282 2.0155 4.1824 2.8049 3.0603 3.0251 3.8883 5.0765 1.6626 1.9836 5.0748 3.5821 5.1490 1.3554 3.2741 4.3593 1.9672 1.6885 2.2727 1.5582 3.4491 1.3237 2.8746 2.1616 2.7217 2.3080 1.2484 1.2930 1.1215 1.3603 1.4107 1.6532 1.3906 1.6205 1.4736 1.2299 1.4887 1.4924 5.8712 1.1655 2.3582 2.6672 7.0697 7.2490 1.0836 1.0724 1.0817 1.0962 1.0855 1.0895 1.0948 1.1003 1.0647 1.0665
irintensity: 6.8063 2.3866 10.8986 51.5840 28.7129 3.7447 20.8942 5.7220 13.2840 9.1129 0.8724 50.7645 84.6855 17.7922 1.0148 1.4193 85.2730 4.6776 1.4043 16.9076 17.6028 16.3105 14.7257 53.3771 0.4331 14.5196 4.8216 31.0804 24.2871 41.3014 35.5143 0.8522 1.2440 18.2361 0.4730 14.4541 2.7083 6.0586 4.0913 42.5627 54.3276 3.8938 9.8935 13.2441 10.5876 0.5669 4.7274 13.1992 25.7696 135.8952 9.8734 1.1869 8.9011 28.4014 26.6592 41.9169 6.3214
temp: 298.150 k
press: 1.00000 atm
elementType: 8 8 6 6 6 6 6 6 6 6 6 1 1 1 1 1 1 1 1 1 1
symmnumber: 1
zpe: 443680.9 jmol-1
zpe.correction: 0.168989 hartree
zpe.thermalcorrener: 0.178243 hartree
zpe.thermalcorrenthalpy: 0.179187 hartree
zpe.thermalcorrgfe: 0.134750 hartree
zpe.sumelectzpe: -498.584438 hartree
zpe.sumelectthermal: -498.575185 hartree
zpe.sumelectthermalent: -498.574240 hartree
zpe.sumelectthermalfe: -498.618678 hartree
dipole: 0.0669 1.2145 -2.7528
dipole: 3.0095
quadrupole: -58.8438 -59.0555 -67.0924
quadrupole: 6.8720 -7.7039 0.0085
quadrupole: 2.8201 2.6084 -5.4285 6.8720 -7.7039 0.0085
hfenergy: -498.7534275 hartree
pointgroup: C01 [X(C9H10O2)]
dipole: -0.030885 -0.5173999 -1.0645601 debye
dipolederiv: -0.6937327 0.0091679 0.1103421 0.0163648 -0.3236952 -0.0156547 0.1705203 0.0626239 -0.7027601 -0.4978118 -0.0529434 0.2026882 -0.1645161 -0.7939232 0.0650418 0.3498352 0.1555604 -0.3308907 0.4985165 0.0352823 0.0144652 0.0082236 0.0987533 -0.0894966 -0.046807 -0.122295 0.5646094 0.5674358 0.2294397 -0.0548035 0.2981017 0.5127711 -0.0671546 -0.1606299 -0.091951 0.302498 -0.0823506 -0.0357959 0.0083018 -0.0042706 -0.0317527 0.0443441 -0.051672 -0.0072451 0.1308322 -0.0876382 -0.0327145 0.0052928 0.1811419 -0.146361 0.0470031 0.0494474 0.0483144 -0.0792066 0.1071553 -0.1627732 0.0310945 -0.2148902 0.0708809 -0.0263971 0.0793588 -0.0435059 -0.023259 -0.0102938 0.0583053 0.0193297 -0.0331688 0.0988091 -0.0062744 -0.0166983 -0.0357942 -0.129983 -0.1231884 0.1111552 0.0097374 0.0893051 0.0936612 0.009114 0.0050298 0.0324367 -0.1552417 -0.0326187 -0.0811668 0.0359113 -0.1186744 -0.0207234 -0.0281537 0.0364682 -0.0238151 -0.1619762 0.0589576 0.0165488 0.0510873 0.075494 0.0027499 0.0146845 0.046423 0.006101 -0.1427168 -0.1797181 0.0393832 -0.1353166 0.0236429 0.0309542 0.0237619 -0.1006348 0.0368422 -0.1426144 -0.0719016 -0.043257 -0.0408957 -0.0884225 -0.0152808 -0.0635594 -0.0242096 -0.0447427 -0.1627977 0.0367792 0.0237008 -0.0016702 0.0349712 -0.0385416 -0.0648163 0.0238569 -0.1146018 0.0492372 0.0055838 0.0344967 -0.0083605 0.0159035 0.0445005 0.0764405 -0.0277013 0.1330953 -0.1148467 0.0916642 -0.0479061 -0.0149845 -0.0219292 -0.0780357 -0.0048776 -0.014692 -0.0009011 0.1481881 0.0776856 -0.0225653 -0.0153193 -0.0548793 -0.1080766 -0.0087522 -0.0171638 -0.0067473 0.149958 0.3696091 -0.031291 -0.0116624 -0.0461441 0.2232311 0.0857268 -0.0579679 0.0478153 0.3207646 0.1288953 -0.0920857 -0.1090709 -0.0460257 0.3208938 -0.0040999 -0.1424232 -0.0452116 0.1847974 -0.0451685 0.1030739 -0.0410616 0.1105636 -0.0087345 0.0250127 -0.0412651 0.0279239 0.150896 -0.11786 -0.0580549 -0.0551051 -0.0607918 0.0679196 -0.0118927 -0.0590748 -0.0139024 0.1445121 unknown
polarizability: 121.7813051|0.8118946|106.9566261|9.5534892|-1.8440054|60.832633 unknown
InChI: InChI=1S/C9H10O2/c10-8-5-6-3-1-2-4-7(6)9(8)11/h1-4,8-11H,5H2
charge 0 multiplicity 1
21 atoms
O  -2.52519 0.734828 1.058351
O  -1.942381 -1.759458 0.292163
C  -2.032823 0.684849 -0.319542
C  -1.367175 -0.71667 -0.58981
C  -0.881519 1.714584 -0.481986
C  0.095818 -0.487458 -0.263563
C  0.377037 0.900001 -0.213157
C  1.101966 -1.447141 -0.04526
C  1.687539 1.344148 0.053504
C  2.417778 -1.000783 0.226953
C  2.707487 0.385415 0.272117
H  -2.879183 0.880695 -1.007901
H  -1.503349 -1.012639 -1.651267
H  -1.023483 2.548343 0.226711
H  -0.875106 2.137178 -1.506454
H  0.863218 -2.515837 -0.062959
H  1.916722 2.414891 0.103135
H  -2.547509 -0.209541 1.383389
H  -2.701542 -2.202609 -0.163347
H  3.215974 -1.729026 0.409451
H  3.729422 0.718228 0.487373
