program: Gaussian 09
title: 000236654
version: EM64L-G09RevD.01
frameworkgroup: C1[X(C16H18ClNO3)]
method: RPBEPBE
basis: SDD
operation: Freq
keyword: #p
keyword: freq=noraman
keyword: PBEPBE/SDD
title: #p freq=noraman PBEPBE/SDD
converged: YES YES NO NO
title: Mulliken charges:
elementType: Cl O O O N C C C C C C C C C C C C C C C C H H H H H H H H H H H H H H H H H H
charge: -0.026758 -0.291538 -0.195575 -0.202831 -0.398281 -0.492708 -0.316377 -0.234716 0.596190 0.069094 0.335410 0.289669 -0.135279 -0.624765 0.007561 -0.685347 -0.693015 -0.375439 -0.374024 -0.232650 -0.222388 0.237876 0.202888 0.242107 0.274715 0.197266 0.182933 0.309230 0.175223 0.214806 0.218862 0.226652 0.200283 0.231187 0.223470 0.289343 0.296097 0.240184 0.240642
chargesum: 0.00000
title: Mulliken charges with hydrogens summed into heavy atoms:
elementType: Cl O O O N C C C C C C C C C C C C C C C C
charge: -0.026758 -0.291538 -0.195575 -0.202831 -0.089051 -0.051944 0.200445 0.145482 0.596190 0.244317 0.335410 0.289669 -0.135279 -0.624765 0.007561 -0.025026 -0.038076 -0.086095 -0.077926 0.007534 0.018254
polarizability: 2.75619984e+02 1.29834799e+01 2.22294601e+02 -5.10606097e+01 2.10246580e+01 1.50702528e+02
1716.lowfreq: -5.4453 -0.0022 -0.0013 -0.0008 3.7620 4.8398 7.3929 17.5739 19.6436
frequency: 5.2344 17.3941 19.5540 43.8800 64.0792 78.9026 111.3223 119.6378 131.8841 152.0481 177.2570 184.0773 195.7581 212.9723 232.1988 251.1838 273.7676 278.2057 315.9806 317.6265 351.9959 370.4997 373.5530 404.6093 414.2456 432.1404 454.7134 456.9463 484.4597 511.2444 519.5270 581.4794 628.2236 653.6856 680.6631 701.1331 729.0770 748.0727 794.8721 803.1636 815.1738 839.5266 853.0531 882.7401 900.2202 918.4496 933.0266 935.5919 944.8078 974.2534 994.5509 1011.8809 1012.7909 1042.0468 1070.7745 1081.6906 1095.6902 1106.0155 1117.3033 1147.1629 1152.6012 1171.5348 1178.0828 1199.2024 1214.3206 1234.2690 1266.2571 1281.3042 1298.6742 1313.3774 1326.8770 1329.7264 1357.7568 1372.9430 1388.6673 1393.1953 1393.5668 1400.1185 1437.3670 1443.5988 1456.3432 1456.6094 1464.5794 1470.3789 1473.2574 1474.0140 1482.2049 1489.8037 1524.7292 1548.7043 1577.8858 1602.4011 1610.9278 2919.3553 2924.7533 2966.9372 2983.7425 2986.9365 2991.9524 3012.7558 3065.4953 3077.9601 3086.5074 3087.3666 3093.8010 3099.3820 3137.6814 3152.7274 3163.5958 3172.9677 3456.7620
redmass: 4.4987 4.7350 3.0831 5.5375 9.5330 5.0681 3.8887 3.9111 5.1639 3.5329 3.5194 2.0175 1.5844 3.8226 1.5133 1.7476 5.9772 7.0763 2.6182 9.4329 3.8563 3.5564 6.4443 3.1069 3.9363 3.6877 7.0239 2.5006 3.4011 2.9679 3.8604 5.3479 1.6399 5.7300 4.3602 7.4708 2.9207 2.0816 8.4360 1.7270 2.1279 5.0503 3.1265 2.4270 2.7492 1.2217 1.7765 1.3961 2.9298 2.7123 1.3942 2.9792 1.3652 2.0106 2.8333 2.7235 2.4959 2.4779 1.9883 2.0528 2.2299 1.0897 1.8765 1.2318 1.2112 2.1903 2.6504 1.2681 2.4487 1.1809 1.3664 1.4554 1.4783 1.2609 1.7624 2.3365 1.4709 9.5817 2.1067 1.3322 1.1028 1.1953 1.0554 2.2908 1.0504 1.1760 1.0777 1.0600 10.7962 10.6320 5.0800 6.5647 6.4205 1.0673 1.0713 1.1023 1.0362 1.0683 1.0357 1.0649 1.0960 1.0989 1.1006 1.0989 1.0995 1.1002 1.0863 1.0903 1.0946 1.1003 1.0749
irintensity: 0.3268 0.2419 1.0661 0.6730 4.8328 0.6527 3.6931 6.5323 1.2915 0.7371 1.2575 0.8308 1.5486 0.3407 2.3155 2.0293 0.2018 0.3707 0.4327 3.1736 0.9655 6.5442 17.0338 7.3871 3.4335 0.6704 5.1205 1.6515 0.9353 7.6564 6.0510 10.1445 116.3360 7.4832 23.8004 0.8157 28.3178 11.5990 77.6044 38.8143 2.9805 0.8560 3.7489 2.8244 8.8021 2.1610 0.1604 0.8633 15.8701 64.0713 3.8191 29.0133 0.3213 9.6815 54.9500 1.9892 17.2272 11.6000 92.2132 27.0158 31.2145 8.1692 13.2956 4.1426 13.3945 82.6146 173.2433 1.8318 30.1429 41.3738 27.8796 8.2150 4.9712 24.0230 28.8646 113.5031 27.8575 3.5269 12.1785 7.9769 18.2492 18.2662 5.9585 0.9922 13.1802 19.4937 0.8137 30.9336 99.6585 469.5016 167.1363 62.8244 75.2543 30.5170 87.7124 70.5915 22.9523 59.4871 16.8143 19.3712 28.7373 34.8659 8.6331 12.6366 65.4815 31.4143 4.6704 6.2674 1.3389 27.0097 56.6310
temp: 298.150 k
press: 1.00000 atm
elementType: 17 8 8 8 7 6 6 6 6 6 6 6 6 6 6 6 6 6 6 6 6 1 1 1 1 1 1 1 1 1 1 1 1 1 1 1 1 1 1
symmnumber: 1
zpe: 808196.9 jmol-1
zpe.correction: 0.307826 hartree
zpe.thermalcorrener: 0.328801 hartree
zpe.thermalcorrenthalpy: 0.329745 hartree
zpe.thermalcorrgfe: 0.253927 hartree
zpe.sumelectzpe: -1359.427738 hartree
zpe.sumelectthermal: -1359.406763 hartree
zpe.sumelectthermalent: -1359.405818 hartree
zpe.sumelectthermalfe: -1359.481636 hartree
dipole: 3.0313 -2.1863 -0.6302
dipole: 3.7902
quadrupole: -109.5632 -139.1020 -129.0575
quadrupole: 21.3956 0.5389 -8.5838
quadrupole: 16.3444 -13.1944 -3.1500 21.3956 0.5389 -8.5838
hfenergy: -1359.7355635 hartree
pointgroup: C01 [X(C16H18Cl1N1O3)]
dipole: -1.2253411 0.6153766 -0.5860656 debye
polarizability: 274.3035098|36.7348881|193.8790445|39.9042588|-40.3507725|180.4345586 unknown
InChI: InChI=1S/C16H18ClNO3/c1-10(2)21-9-5-8-18-14-13(17)15(19)11-6-3-4-7-12(11)16(14)20/h3-4,6-7,10,18H,5,8-9H2,1-2H3
charge 0 multiplicity 1
39 atoms
Cl 0.314014 -2.866912 1.514395
O  -4.229065 0.335349 -0.182174
O  0.322156 0.90814 -2.054574
O  3.015585 -1.605906 2.057388
N  -0.928093 -1.262969 -0.704449
C  -3.256803 -1.428174 -1.504868
C  -1.903138 -0.709134 -1.67301
C  -3.960979 -1.103817 -0.177736
C  0.316312 -0.812359 -0.352753
C  -5.018643 0.823038 0.97559
C  2.269545 0.833618 -0.633779
C  2.966059 0.176486 0.417373
C  0.931354 0.361517 -1.083068
C  1.059545 -1.429606 0.66312
C  2.377727 -1.019879 1.119623
C  -4.194298 0.802972 2.278496
C  -5.469612 2.235984 0.586871
C  2.852827 1.954244 -1.276701
C  4.237369 0.645263 0.816096
C  4.120782 2.419371 -0.873357
C  4.813365 1.76368 0.174806
H  -3.915622 -1.111108 -2.33306
H  -3.126277 -2.526507 -1.593914
H  -1.522696 -0.831785 -2.703423
H  -2.034451 0.371578 -1.503243
H  -4.91463 -1.672347 -0.101375
H  -3.325917 -1.386086 0.691374
H  -1.236217 -2.092623 -0.18354
H  -5.909322 0.162647 1.090661
H  -4.792731 1.210344 3.114174
H  -3.882594 -0.219181 2.55876
H  -3.288241 1.4246 2.1642
H  -6.09618 2.677495 1.382535
H  -6.05052 2.211644 -0.350754
H  -4.589559 2.885314 0.431621
H  2.296243 2.439315 -2.08469
H  4.749508 0.1176 1.626505
H  4.570228 3.285633 -1.369845
H  5.798966 2.124461 0.488025
