program: Gaussian 09
title: 000236653
version: EM64L-G09RevD.01
frameworkgroup: C1[X(C14H14ClNO3)]
method: RPBEPBE
basis: SDD
operation: Freq
keyword: #p
keyword: freq=noraman
keyword: PBEPBE/SDD
title: #p freq=noraman PBEPBE/SDD
converged: YES YES NO NO
title: Mulliken charges:
elementType: Cl O O O N C C C C C C C C C C C C C C H H H H H H H H H H H H H H
charge: -0.018921 -0.271060 -0.201500 -0.199247 -0.401674 -0.325806 -0.476812 0.595740 0.336915 0.291055 -0.134420 -0.244042 -0.628565 0.007759 -0.374803 -0.372989 -0.232074 -0.221652 -0.499544 0.252261 0.241057 0.240974 0.224490 0.317426 0.190225 0.192985 0.289430 0.296638 0.241016 0.241652 0.202898 0.204049 0.236537
chargesum: 0.00000
title: Mulliken charges with hydrogens summed into heavy atoms:
elementType: Cl O O O N C C C C C C C C C C C C C C
charge: -0.018921 -0.271060 -0.201500 -0.199247 -0.084248 0.167513 -0.011347 0.595740 0.336915 0.291055 -0.134420 0.139167 -0.628565 0.007759 -0.085373 -0.076351 0.008943 0.020000 0.143940
polarizability: 2.82405356e+02 -4.86805808e+00 2.09782230e+02 -2.32543612e+01 5.29630369e+00 9.45743213e+01
1716.lowfreq: -6.7755 -6.2335 -0.0013 0.0017 0.0018 2.0336 14.7518 28.8484 51.1073
frequency: 14.6825 28.7582 51.0906 62.5499 69.1530 94.5133 122.7831 133.1683 142.2371 174.3034 191.1674 207.9364 224.8957 246.7028 275.0591 280.2296 315.4632 360.0896 371.1477 401.9873 410.9265 415.6790 433.2401 466.7084 516.8758 523.2421 581.5447 633.8604 653.5553 681.2167 702.9413 729.3966 788.8468 800.3673 803.2193 840.4177 855.4132 862.1421 908.1586 934.2121 935.1210 994.8254 995.8783 1013.0864 1035.9733 1066.9455 1080.9665 1081.9578 1099.6810 1104.2792 1121.4098 1154.9674 1160.2697 1172.0091 1188.9079 1233.7005 1240.7380 1265.9456 1277.0503 1296.8659 1323.9937 1330.0216 1388.2628 1389.1973 1400.3394 1438.0296 1439.9119 1450.5627 1459.5370 1467.6956 1470.0226 1473.9120 1476.3955 1491.3475 1525.0301 1547.0652 1577.3238 1602.3653 1609.8365 2907.3885 2928.9003 2953.7724 2998.6775 3001.8911 3004.7182 3060.2659 3072.8435 3106.7793 3138.1821 3153.0251 3163.8089 3173.2428 3460.0426
redmass: 5.0272 4.6477 2.7886 4.6818 5.0091 3.3742 4.3276 4.3140 4.7659 5.4823 5.3457 2.8165 1.2051 3.2374 6.4096 6.6506 9.0208 6.6132 8.4008 3.3283 4.6275 3.9422 3.9113 9.2735 3.0693 5.1231 5.2885 1.5831 5.6041 4.3281 7.3569 2.9067 1.5732 4.3252 1.7305 5.1130 2.9494 1.9618 3.7524 1.9700 2.3735 1.3951 3.6646 1.3623 2.1301 4.4786 3.3973 2.7497 2.4487 1.5865 1.5615 2.0264 1.5090 1.0850 1.3751 1.9858 1.2549 2.6855 1.2124 2.6123 1.4051 1.2970 1.4225 7.3297 9.6717 2.2921 1.1629 1.4514 1.0509 1.1941 1.9829 1.0865 1.1649 1.0801 10.7171 10.4838 5.0039 6.6545 6.3964 1.0533 1.0353 1.1052 1.0632 1.1028 1.0637 1.0998 1.1002 1.0973 1.0863 1.0903 1.0946 1.1003 1.0752
irintensity: 0.2336 0.4105 3.9601 10.3272 2.0653 1.0712 0.7919 1.3021 2.0431 0.3506 0.6343 2.3032 3.3266 0.9924 0.0537 0.1925 3.0732 0.1959 17.3275 6.0241 5.1298 3.1167 0.6912 5.3712 4.3197 12.5462 7.7634 104.7704 6.6322 24.6664 1.2372 28.9738 20.5779 66.0660 40.0670 1.2634 5.1025 6.6151 9.3279 5.6953 17.3795 4.1109 24.1117 0.1846 2.3887 118.7277 18.5381 4.0290 28.2473 26.7058 30.7383 18.7829 9.3199 7.9206 1.8356 88.6228 5.6024 175.9411 3.8982 30.5660 15.9513 30.0359 22.4178 144.8961 1.8152 10.0486 1.1531 5.1737 13.0616 49.9840 3.0019 21.6499 4.7242 5.6844 87.7234 482.5187 181.6280 56.2970 77.8241 76.4243 85.7353 60.7866 17.6659 67.6950 16.5110 18.8287 32.1733 33.4912 4.5128 5.8455 1.2820 26.4918 58.1558
temp: 298.150 k
press: 1.00000 atm
elementType: 17 8 8 8 7 6 6 6 6 6 6 6 6 6 6 6 6 6 6 1 1 1 1 1 1 1 1 1 1 1 1 1 1
symmnumber: 1
zpe: 662820.0 jmol-1
zpe.correction: 0.252455 hartree
zpe.thermalcorrener: 0.270766 hartree
zpe.thermalcorrenthalpy: 0.271710 hartree
zpe.thermalcorrgfe: 0.203503 hartree
zpe.sumelectzpe: -1280.970033 hartree
zpe.sumelectthermal: -1280.951723 hartree
zpe.sumelectthermalent: -1280.950778 hartree
zpe.sumelectthermalfe: -1281.018985 hartree
dipole: 0.8210 -3.4091 1.2616
dipole: 3.7266
quadrupole: -98.5246 -130.7868 -116.3418
quadrupole: 12.1631 4.6657 -0.7741
quadrupole: 16.6931 -15.5691 -1.1241 12.1631 4.6657 -0.7741
hfenergy: -1281.2224881 hartree
pointgroup: C01 [X(C14H14Cl1N1O3)]
dipole: -0.3853946 -1.4034918 0.1767719 debye
polarizability: 282.6981467|-9.6381371|181.1658111|-21.4702415|-49.6979402|122.8979495 unknown
InChI: InChI=1S/C14H14ClNO3/c1-19-8-4-7-16-12-11(15)13(17)9-5-2-3-6-10(9)14(12)18/h2-3,5-6,16H,4,7-8H2,1H3
charge 0 multiplicity 1
33 atoms
Cl -0.668991 2.723704 -0.967897
O  -5.874359 -0.065383 -0.217978
O  0.107238 -1.843346 1.382621
O  2.304733 2.373334 -1.422096
N  -1.581662 0.288229 0.539312
C  -2.416857 -0.708299 1.250888
C  -3.901504 -0.31468 1.137164
C  -0.238374 0.274905 0.26437
C  2.065983 -0.856711 0.381009
C  2.631515 0.233066 -0.336018
C  0.617995 -0.885103 0.721844
C  -4.462298 -0.442985 -0.286411
C  0.376072 1.323241 -0.433511
C  1.787495 1.399189 -0.780534
C  2.887219 -1.938607 0.786968
C  4.010695 0.232169 -0.640136
C  4.262901 -1.935186 0.480036
C  4.82482 -0.848108 -0.234527
C  -6.5348 -0.136192 -1.520399
H  -2.115075 -0.763869 2.313271
H  -2.241502 -1.713012 0.828849
H  -4.490478 -0.97226 1.801427
H  -4.061522 0.720765 1.497215
H  -2.066856 1.141193 0.236651
H  -3.9238 0.220493 -1.00189
H  -4.356429 -1.490161 -0.651955
H  2.427197 -2.764169 1.338963
H  4.416877 1.085552 -1.191648
H  4.896626 -2.771129 0.793712
H  5.893826 -0.844828 -0.472882
H  -6.509859 -1.166879 -1.934588
H  -6.065092 0.554302 -2.25323
H  -7.580538 0.165066 -1.353099
