program: Gaussian 09
title: 000236648
version: EM64L-G09RevD.01
frameworkgroup: C1[X(C11H16N2O2S)]
method: RPBEPBE
basis: SDD
operation: Freq
keyword: #p
keyword: freq=noraman
keyword: PBEPBE/SDD
title: #p freq=noraman PBEPBE/SDD
converged: YES YES NO NO
title: Mulliken charges:
elementType: S O O N N C C C C C C C C C C C H H H H H H H H H H H H H H H H
charge: 0.915266 -0.545661 -0.542024 -0.250710 -0.689010 -0.442287 -0.423390 -0.382432 -0.377281 -0.384455 -0.063584 -0.204729 -0.248512 -0.391371 -0.393778 0.512560 0.227966 0.279418 0.243518 0.228114 0.201739 0.234591 0.250648 0.195509 0.220139 0.181946 0.272273 0.291726 0.228398 0.228981 0.313272 0.313161
chargesum: 0.00000
title: Mulliken charges with hydrogens summed into heavy atoms:
elementType: S O O N N C C C C C C C C C C C
charge: 0.915266 -0.545661 -0.542024 -0.250710 -0.062577 0.065097 0.048241 0.053898 0.068875 0.017631 -0.063584 0.067544 0.043215 -0.162973 -0.164798 0.512560
polarizability: 2.34592370e+02 -1.43030725e+01 1.36658643e+02 -4.43283809e+00 -1.35187715e+01 1.34413172e+02
1716.lowfreq: -17.5838 -10.9893 -0.0013 -0.0006 0.0024 1.6094 22.7122 32.5725 46.0914
frequency: 21.0207 32.4638 45.7301 96.0170 122.2198 135.3567 172.2342 196.9472 227.3436 242.6990 289.4402 294.0988 297.8183 350.6916 391.3635 399.1693 402.7719 412.7554 414.2443 420.1947 429.6932 461.6928 487.6534 522.5474 585.6266 615.6962 624.2313 718.3495 778.4240 785.1551 789.6119 810.0881 812.4680 834.5701 842.9685 852.9076 873.4436 918.2482 934.7725 944.3866 971.8017 983.4584 1004.0022 1020.2683 1032.3391 1054.5280 1064.5525 1101.1784 1128.2633 1131.4172 1148.1787 1181.6826 1190.7324 1248.3640 1268.8956 1288.6795 1297.8932 1319.8871 1321.9251 1337.1335 1340.7986 1347.3394 1360.8757 1398.4590 1431.6608 1440.9017 1444.1095 1458.8288 1465.7120 1469.4876 1490.3143 1586.4191 1614.5065 1647.3739 2962.3285 2964.7244 2971.6537 2986.2030 2991.1277 3036.7639 3040.4217 3047.3867 3058.3053 3063.3601 3131.0503 3133.7476 3158.7436 3168.1115 3563.0354 3702.0844
redmass: 4.0211 3.8228 4.2815 4.3203 5.5359 4.3807 4.3424 3.8807 8.7583 3.9185 6.3153 2.9253 2.7701 3.3644 2.1766 3.1572 1.0299 2.9927 2.3756 1.9116 3.3926 3.3399 3.6484 2.7696 2.5655 5.2029 6.8547 2.9589 4.3411 1.6391 7.4426 4.0412 1.4320 1.7400 2.0738 1.7966 2.7718 12.4504 1.4066 1.3807 1.3303 4.6648 2.3824 1.4344 2.0553 2.5406 1.7684 2.1523 1.2085 2.1157 1.4244 1.1199 1.6194 1.3003 1.1721 1.2247 1.3014 2.5782 1.2216 1.3772 1.3699 1.4318 1.3173 5.5346 3.7274 1.0796 1.0805 1.0836 1.0831 1.0909 2.9491 7.4042 4.7260 1.2309 1.0649 1.0644 1.0663 1.0609 1.0623 1.0959 1.0965 1.1009 1.0989 1.1026 1.0892 1.0893 1.0954 1.0960 1.0452 1.1040
irintensity: 1.6050 0.6669 2.0349 0.6489 0.1784 2.0643 0.0301 5.0195 14.0023 5.2964 8.0953 4.9306 2.0466 8.5562 3.4253 6.2793 3.4687 2.5475 78.0953 182.8987 97.6190 2.8984 60.9776 37.8514 25.3152 88.0745 6.0762 1.5323 29.3128 6.2580 65.6569 19.5585 13.2684 66.0110 56.4977 0.5857 3.1088 79.5330 1.6330 0.9814 0.2777 3.2141 4.2912 1.0220 10.5872 53.7845 8.7760 1.0733 15.9031 8.5840 2.2551 45.0102 12.7672 16.3964 7.8880 17.9419 4.6861 72.4895 1.8605 6.7327 1.6683 2.0601 3.4979 4.8711 1.9027 24.6643 7.2512 11.7916 17.7063 15.3932 76.1349 6.9580 156.8702 270.7796 44.3071 14.3129 32.8045 27.8232 37.8239 63.4171 23.5200 32.2031 0.1526 36.4310 14.0529 16.2037 9.1838 5.1725 106.9880 24.7219
temp: 298.150 k
press: 1.00000 atm
elementType: 16 8 8 7 7 6 6 6 6 6 6 6 6 6 6 6 1 1 1 1 1 1 1 1 1 1 1 1 1 1 1 1
symmnumber: 1
zpe: 676835.9 jmol-1
zpe.correction: 0.257793 hartree
zpe.thermalcorrener: 0.273876 hartree
zpe.thermalcorrenthalpy: 0.274821 hartree
zpe.thermalcorrgfe: 0.213435 hartree
zpe.sumelectzpe: -1085.398175 hartree
zpe.sumelectthermal: -1085.382092 hartree
zpe.sumelectthermalent: -1085.381148 hartree
zpe.sumelectthermalfe: -1085.442533 hartree
dipole: 4.5125 -4.0939 -3.9683
dipole: 7.2712
quadrupole: -64.3845 -108.6455 -106.5730
quadrupole: -3.0395 0.9541 -6.6805
quadrupole: 28.8165 -15.4445 -13.3720 -3.0395 0.9541 -6.6805
hfenergy: -1085.6559683 hartree
pointgroup: C01 [X(C11H16N2O2S1)]
dipole: -1.7800367 -2.0281691 -0.9495683 debye
polarizability: 232.2063163|6.0667049|123.487969|19.3535899|-7.3239481|149.9698995 unknown
InChI: InChI=1S/C11H16N2O2S/c12-10-4-6-11(7-5-10)16(14,15)13-8-2-1-3-9-13/h4-7H,1-3,8-9,12H2
charge 0 multiplicity 1
32 atoms
S  0.609722 0.809453 0.612335
O  1.158452 1.722975 -0.638502
O  0.669389 1.398476 2.132441
N  1.421598 -0.918783 0.757656
N  -5.092134 -0.680078 -0.802491
C  2.636113 -0.848011 1.625381
C  1.659942 -1.520012 -0.590499
C  3.910771 -0.331902 0.916199
C  2.928102 -1.017729 -1.32266
C  4.164705 -1.107533 -0.397879
C  -1.132808 0.308244 0.172809
C  -1.914158 -0.372018 1.125567
C  -1.631172 0.68098 -1.088451
C  -3.23897 -0.704114 0.795306
C  -2.957737 0.348622 -1.414982
C  -3.780652 -0.350742 -0.480148
H  2.788513 -1.886855 1.985343
H  2.376657 -0.224797 2.499763
H  0.75267 -1.364864 -1.203245
H  1.737818 -2.61113 -0.401078
H  4.771306 -0.433624 1.605115
H  3.792305 0.747008 0.696358
H  2.771601 0.030931 -1.636377
H  3.077887 -1.625509 -2.236078
H  5.056866 -0.705967 -0.913415
H  4.379537 -2.171753 -0.162879
H  -1.495117 -0.631631 2.10237
H  -0.988848 1.232425 -1.783326
H  -3.863816 -1.23559 1.522491
H  -3.364926 0.632333 -2.392452
H  -5.488759 -0.423701 -1.702088
H  -5.687855 -1.164501 -0.137185
