program: Gaussian 09
title: 000236646
version: EM64L-G09RevD.01
frameworkgroup: C1[X(C7H7NO4S)]
method: RPBEPBE
basis: SDD
operation: Freq
keyword: #p
keyword: freq=noraman
keyword: PBEPBE/SDD
title: #p freq=noraman PBEPBE/SDD
converged: NO YES NO NO
title: Mulliken charges:
elementType: S O O O O N C C C C C C C H H H H H H H
charge: 0.901696 -0.526455 -0.527335 -0.348786 -0.119349 -0.686454 -0.156147 -0.201782 -0.202293 0.511038 -0.385605 -0.385911 0.071957 0.285899 0.281872 0.232402 0.231334 0.315893 0.315442 0.392585
chargesum: 0.00000
title: Mulliken charges with hydrogens summed into heavy atoms:
elementType: S O O O O N C C C C C C C
charge: 0.901696 -0.526455 -0.527335 0.043799 -0.119349 -0.055119 -0.156147 0.084117 0.079579 0.511038 -0.153203 -0.154577 0.071957
polarizability: 1.80683841e+02 -3.52304760e+00 1.15670213e+02 -1.55185883e+00 -1.16364668e+01 9.20641785e+01
1716.lowfreq: -0.0027 -0.0023 -0.0010 3.3914 5.6333 12.1110 30.6995 43.0643 52.6161
frequency: 30.6621 43.0266 52.5946 121.1075 126.6347 157.6633 204.7562 227.3335 263.2766 290.4703 335.0553 369.2894 405.3156 414.2270 414.2736 428.0397 445.1212 472.7678 519.7760 580.3159 596.8641 608.1923 622.0219 717.8225 795.2226 810.5907 818.7481 836.6250 940.3650 953.8427 965.5757 968.4127 981.7730 1021.9761 1052.3117 1131.7224 1184.7791 1237.8098 1300.9030 1322.8146 1399.3124 1434.7499 1490.2692 1584.5920 1613.9479 1648.6646 1711.7875 3133.8258 3135.7185 3159.0962 3163.0768 3439.2127 3562.0337 3700.7878
redmass: 11.9957 4.2162 6.6747 5.6978 7.5656 11.4185 12.0307 9.4172 7.7635 5.9515 6.3680 5.9954 3.4636 1.5054 1.5313 1.8289 2.4516 2.5019 2.7958 4.0034 2.4046 6.1484 6.9114 2.9429 10.8390 5.9328 1.2564 1.8491 15.7256 1.4493 1.8623 2.1468 4.8534 1.4383 2.5560 1.1954 1.1167 1.6413 1.2922 2.6187 5.4034 3.8202 2.9311 7.3513 4.7918 1.2257 12.8866 1.0889 1.0888 1.0958 1.0967 1.0641 1.0453 1.1040
irintensity: 1.3229 0.9095 2.3787 0.5240 0.4574 0.9682 5.8016 4.9013 1.8823 10.5571 4.6004 8.8654 0.4765 0.6236 0.2520 67.0534 333.1949 212.8507 45.3682 57.4264 73.0749 7.8344 0.5610 0.8847 65.7195 47.0070 0.3002 72.0546 71.4379 29.2332 83.9202 105.8333 8.8656 1.2678 56.1033 14.8465 45.0156 102.0996 5.3938 70.1426 4.8597 2.0973 65.5761 7.7092 172.8895 267.9498 280.0019 13.3266 10.8511 3.2733 12.1132 7.9548 112.3177 26.1072
temp: 298.150 k
press: 1.00000 atm
elementType: 16 8 8 8 8 7 6 6 6 6 6 6 6 1 1 1 1 1 1 1
symmnumber: 1
zpe: 352582.3 jmol-1
zpe.correction: 0.134292 hartree
zpe.thermalcorrener: 0.147704 hartree
zpe.thermalcorrenthalpy: 0.148649 hartree
zpe.thermalcorrgfe: 0.093118 hartree
zpe.sumelectzpe: -1023.521360 hartree
zpe.sumelectthermal: -1023.507947 hartree
zpe.sumelectthermalent: -1023.507003 hartree
zpe.sumelectthermalfe: -1023.562533 hartree
dipole: 7.2467 -3.9587 -4.3216
dipole: 9.3200
quadrupole: -60.2769 -79.1249 -89.1022
quadrupole: 9.7351 4.5532 2.0905
quadrupole: 15.8911 -2.9569 -12.9342 9.7351 4.5532 2.0905
hfenergy: -1023.6556512 hartree
pointgroup: C01 [X(C7H7N1O4S1)]
dipole: -2.8381121 -1.3507282 1.8883403 debye
dipolederiv: 1.9224715 -0.0191247 -0.0998803 -0.0524562 1.0938509 -0.1540908 -0.1046456 -0.1089243 1.2819294 -0.6948214 0.032201 0.0359832 0.0705739 -0.4792514 -0.1856211 0.000744 -0.0083231 -0.7030353 -0.6752245 -0.033914 0.0251893 -0.0402312 -0.6545442 0.1947576 -0.01102 0.0095784 -0.4745357 -0.3883811 0.0074428 -0.0289905 0.2834386 -1.1483569 0.3059448 -0.1553233 0.2041158 -0.4178796 -0.6276572 -0.1480958 -0.4616721 -0.1564042 -0.5572314 -0.073204 -0.77794 -0.1553198 -0.8676456 -1.7393678 -0.037779 0.1489001 -0.0695088 -0.1659049 0.2107965 0.2365637 0.2089937 -0.6874496 -0.5758515 -0.0145106 0.0445116 -0.0036544 -0.3211806 -0.0067897 0.0497356 -0.0165801 -0.292438 0.228541 -0.043653 -0.0928843 -0.3218804 0.0544131 0.0807573 -0.1820469 0.0308086 -0.0296942 0.2326461 0.0858003 -0.0438795 0.343445 0.0759672 0.0001126 0.0505175 0.0476058 -0.0486683 1.8136179 0.0864578 -0.2859918 0.1076467 0.0733926 -0.0551736 -0.3488595 -0.0528446 0.2118566 -0.5330339 -0.0178336 0.0314993 -0.4149376 -0.0049428 0.1505259 -0.0713542 0.0735822 -0.1662373 -0.5231452 0.0062862 0.038418 0.3786739 0.0343744 0.0170961 0.2073902 0.0900732 -0.2140285 0.5593202 0.1337498 0.6903669 -0.092793 1.30229 -0.2239092 1.1756041 -0.0675029 1.0189627 0.1302813 -0.0713919 -0.0080031 -0.0324747 0.0658774 -0.0261733 -0.016025 -0.0031811 0.1383229 0.1279187 0.0568059 0.0392609 0.0377127 0.072448 -0.0217359 0.0107408 -0.0418721 0.1232836 -0.0353953 0.0783466 0.0656211 0.0624095 -0.0080059 -0.0744164 0.072312 -0.0809909 0.132776 -0.0379247 -0.1018303 0.0015126 -0.095123 -0.0273256 -0.0552523 0.0182143 -0.0489087 0.1523039 0.2468427 -0.0282189 0.0252565 -0.0673761 0.1494281 -0.0722733 -0.0022723 -0.0753563 0.3571413 0.2480039 0.0040292 0.0366808 0.0514788 0.1581108 -0.0891 0.0395077 -0.0853096 0.3464981 0.3211592 0.0252324 -0.1618986 0.0114605 0.286591 0.0777489 -0.1918429 0.0803557 0.1385376 unknown
polarizability: 180.6717769|2.953132|117.758384|-2.994844|8.9430253|89.9880717 unknown
InChI: InChI=1S/C7H7NO4S/c8-5-1-3-6(4-2-5)13(11,12)7(9)10/h1-4,9H,8H2
charge 0 multiplicity 1
20 atoms
S  1.618686 0.300924 -0.776955
O  1.96243 -0.780354 -1.951076
O  1.993717 1.883721 -0.881537
O  2.389978 -1.690362 1.02275
O  3.145928 0.430169 1.722398
N  -4.285643 -0.112034 0.507744
C  -0.192193 0.156941 -0.345109
C  -0.842503 1.282319 0.195085
C  -0.860572 -1.048579 -0.628778
C  -2.929408 -0.021968 0.223302
C  -2.214596 1.188822 0.482026
C  -2.232719 -1.136272 -0.340724
C  2.56128 -0.329709 0.954809
H  -0.286669 2.210963 0.363176
H  -0.318743 -1.885061 -1.082235
H  -2.742421 2.053493 0.90044
H  -2.775271 -2.064126 -0.555543
H  -4.791832 0.679035 0.895729
H  -4.805637 -0.962768 0.311983
H  2.844888 -2.088952 1.818717
