program: Gaussian 09
title: 000236643
version: EM64L-G09RevD.01
frameworkgroup: C1[X(C10H13N2O2P)]
method: RPBEPBE
basis: SDD
operation: Freq
keyword: #p
keyword: freq=noraman
keyword: PBEPBE/SDD
title: #p freq=noraman PBEPBE/SDD
converged: YES YES NO NO
title: Mulliken charges:
elementType: P O O N N C C C C C C C C C C H H H H H H H H H H H H H
charge: 1.221354 -0.555277 -0.598372 -0.429450 -0.410396 -0.368315 -0.394363 -0.386476 -0.385215 0.369432 -0.353476 -0.378682 -0.204698 -0.194728 -0.251960 0.250112 0.268129 0.262151 0.254098 0.255359 0.268383 0.265687 0.256266 0.303682 0.250593 0.228872 0.228504 0.228786
chargesum: 0.00000
title: Mulliken charges with hydrogens summed into heavy atoms:
elementType: P O O N N C C C C C C C C C C
charge: 1.221354 -0.555277 -0.598372 -0.429450 -0.410396 0.149926 0.121886 0.137266 0.136739 0.369432 -0.049794 -0.128088 0.024175 0.033775 -0.023174
polarizability: 1.86814539e+02 -9.38585735e+00 1.24756989e+02 5.99220225e-01 9.19558965e+00 1.30057500e+02
1716.lowfreq: -0.0019 -0.0015 -0.0011 4.5642 8.2715 13.6376 25.8298 28.6139 48.7060
frequency: 25.3795 28.1061 48.5264 61.7992 84.8252 118.2020 140.4538 159.0637 193.3779 233.9963 246.2244 276.2858 311.5416 355.2118 372.8034 411.2071 430.0527 488.2989 518.6498 535.8253 607.5689 625.3938 649.4783 694.3070 764.1497 778.6436 804.4766 809.8554 824.2368 825.7720 840.1694 883.1188 910.2775 914.9836 971.0911 984.8750 989.3946 996.1577 998.9327 1020.6275 1026.5101 1073.9018 1076.7453 1079.9113 1119.3763 1121.1017 1125.2118 1126.7587 1149.0534 1155.1091 1162.9322 1171.5155 1190.8627 1236.4126 1260.2653 1311.2896 1378.7299 1440.1077 1450.1426 1453.7936 1466.2115 1468.5350 1471.9968 1591.4098 1602.2749 3083.5530 3086.9443 3089.4551 3095.8761 3129.0049 3138.7714 3155.3237 3164.0672 3172.8194 3192.8324 3193.6432 3209.1215 3210.7882
redmass: 4.6451 4.0572 3.2266 3.3175 4.7091 3.3552 3.8598 4.7291 4.1533 4.2266 7.1949 4.5002 6.2495 5.2740 5.0851 2.9485 6.8513 3.9622 8.0456 5.4204 6.7359 9.6573 9.6417 2.2378 1.5528 8.9429 1.0799 1.1061 6.1850 8.4995 1.2685 4.6169 4.4019 1.4585 1.3622 5.0571 1.3695 1.0617 1.1021 2.3841 5.7686 1.2799 1.5247 1.2696 1.3301 1.3142 1.2823 1.2900 1.4034 1.3923 1.4270 1.2705 1.6791 3.2480 3.5884 1.3343 8.2627 2.2838 1.0759 1.0766 1.1697 1.2157 2.0562 6.3945 6.2736 1.0489 1.0500 1.0612 1.0585 1.0849 1.0895 1.0934 1.0965 1.1004 1.1182 1.1190 1.1177 1.1184
irintensity: 1.0120 0.4549 2.0624 3.8863 6.6891 0.2206 2.4397 6.3048 14.0840 4.8675 5.8915 2.9165 1.7696 11.0908 6.2083 0.1044 24.1890 22.4814 47.2127 14.8849 19.1297 89.3575 106.3121 30.0239 88.6565 11.4494 48.4474 23.3858 151.3451 35.2318 5.9248 135.2450 170.7954 33.8860 0.9584 2.0643 1.8240 2.6174 3.2562 35.8254 75.3270 7.6826 10.5095 5.6296 8.0641 7.9848 10.3866 5.4777 0.2381 1.5702 88.2199 59.4558 115.9577 54.1481 83.7402 0.6491 2.2326 8.5393 8.0195 7.2655 4.3582 4.4872 123.2516 28.9318 57.4902 11.0491 16.1618 18.3020 24.2158 0.3220 17.6239 15.5127 14.1510 14.1779 0.7897 1.6924 7.9588 15.1881
temp: 298.150 k
press: 1.00000 atm
elementType: 15 8 8 7 7 6 6 6 6 6 6 6 6 6 6 1 1 1 1 1 1 1 1 1 1 1 1 1
symmnumber: 1
zpe: 565628.5 jmol-1
zpe.correction: 0.215437 hartree
zpe.thermalcorrener: 0.230650 hartree
zpe.thermalcorrenthalpy: 0.231594 hartree
zpe.thermalcorrgfe: 0.170902 hartree
zpe.sumelectzpe: -988.808129 hartree
zpe.sumelectthermal: -988.792916 hartree
zpe.sumelectthermalent: -988.791971 hartree
zpe.sumelectthermalfe: -988.852663 hartree
dipole: -0.1045 -0.1126 -2.4007
dipole: 2.4056
quadrupole: -86.0845 -85.7735 -98.4719
quadrupole: -4.4649 -2.8857 -0.7783
quadrupole: 4.0255 4.3364 -8.3619 -4.4649 -2.8857 -0.7783
hfenergy: -989.0235655 hartree
pointgroup: C01 [X(C10H13N2O2P1)]
dipole: 0.095057 0.2728204 -0.901274 debye
polarizability: 186.6381473|-9.4158051|129.7521704|0.3078567|-9.830908|125.2387108 unknown
InChI: InChI=1S/C10H13N2O2P/c13-15(11-6-7-11,12-8-9-12)14-10-4-2-1-3-5-10/h1-5H,6-9H2
charge 0 multiplicity 1
28 atoms
P  -1.567247 -0.318495 0.464608
O  -0.20254 0.761383 0.1427
O  -1.434685 -1.196288 1.793127
N  -2.92215 0.777837 0.406579
N  -1.73372 -1.179336 -1.088594
C  -2.937126 2.045968 -0.408282
C  -2.918882 2.108558 1.113624
C  -2.439073 -2.53038 -1.043875
C  -0.939404 -2.471355 -1.244611
C  1.16356 0.392559 0.279638
C  1.62604 -0.444236 1.323605
C  2.055773 0.954743 -0.660628
C  3.010101 -0.719156 1.408964
C  3.436544 0.67822 -0.551499
C  3.919192 -0.162045 0.47974
H  -3.872461 2.21042 -0.951215
H  -2.018061 2.322988 -0.935119
H  -1.987747 2.436626 1.590355
H  -3.837618 2.323927 1.666376
H  -3.101732 -2.700509 -1.896697
H  -2.802326 -2.884363 -0.07149
H  -0.307664 -2.796069 -0.409101
H  -0.51309 -2.598545 -2.243385
H  0.915853 -0.861946 2.044385
H  1.659955 1.594427 -1.455395
H  3.376254 -1.366172 2.214079
H  4.132381 1.115787 -1.276078
H  4.990176 -0.376944 0.559288
