program: Gaussian 09
title: 000236642
version: EM64L-G09RevD.01
frameworkgroup: C1[X(C9H13N5O)]
method: RPBEPBE
basis: SDD
operation: Freq
keyword: #p
keyword: freq=noraman
keyword: PBEPBE/SDD
title: #p freq=noraman PBEPBE/SDD
converged: YES YES NO NO
title: Mulliken charges:
elementType: O N N N N N C C C C C C C C C H H H H H H H H H H H H H
charge: -0.211025 -0.170789 -0.429853 -0.028300 -0.056286 -0.626741 -0.410736 -0.348311 0.358485 -0.334752 -0.139919 -0.250798 -0.686681 0.018996 0.164521 0.230902 0.215932 0.227056 0.196367 0.203390 0.191982 0.265130 0.307419 0.224341 0.210959 0.219140 0.303774 0.355796
chargesum: 0.00000
title: Mulliken charges with hydrogens summed into heavy atoms:
elementType: O N N N N N C C C C C C C C C
charge: -0.211025 -0.170789 -0.122435 -0.028300 -0.056286 0.032829 0.036099 0.075112 0.358485 0.060620 -0.139919 0.014332 -0.032240 0.018996 0.164521
polarizability: 1.71085403e+02 3.34637352e-01 1.53182399e+02 -1.61539654e+01 -5.71474949e+00 8.17560948e+01
1716.lowfreq: -5.2688 -0.0008 -0.0007 -0.0007 2.2521 5.1571 31.4689 43.4893 66.7998
frequency: 31.3018 43.4721 66.7138 68.7139 111.1720 137.6285 146.8485 196.5097 200.8746 227.0245 233.9485 279.5022 324.0143 331.3736 366.7739 426.7314 438.2490 465.6217 497.3794 525.2813 598.6208 625.7872 644.6466 650.5984 687.1321 723.1315 732.8387 748.8044 779.8794 790.0499 820.6525 903.2143 920.6249 934.2254 968.6740 1009.7701 1031.1976 1073.2247 1081.6870 1113.8173 1151.1976 1182.2219 1195.9434 1243.9426 1261.0767 1269.2443 1288.9071 1306.6560 1320.6781 1336.5498 1342.6052 1357.9568 1383.5499 1396.3926 1422.4029 1468.6539 1472.0453 1477.6710 1481.5323 1491.7451 1527.9401 1539.8456 1601.2122 1621.9875 1649.0570 2965.6936 2976.0276 2979.5481 2981.6612 3009.9628 3037.7141 3062.8394 3075.5341 3081.4246 3230.2517 3535.4010 3550.3433 3702.0669
redmass: 4.0193 5.5973 1.5254 2.3219 2.4043 2.3222 5.3004 2.5005 1.9895 2.0997 1.7747 5.5462 5.7107 4.4397 3.6743 2.6071 1.4425 6.9645 6.1218 1.1539 6.2330 3.6326 5.1963 10.1000 8.5674 4.1873 1.1362 1.9210 3.9897 1.2301 7.6621 1.7446 1.5206 3.3273 2.2247 4.2868 3.4283 2.5499 2.2969 2.3133 3.2140 2.1455 1.8023 1.6389 1.7548 1.3114 1.0816 2.3140 1.5573 6.2598 1.3740 1.4971 6.1743 1.2091 3.9774 1.1100 1.0786 1.0418 1.0801 1.1028 4.1002 4.7429 1.5756 6.7684 4.1520 1.0596 1.0616 1.0376 1.0659 1.0970 1.0980 1.1019 1.1006 1.0996 1.0983 1.0768 1.0467 1.1049
irintensity: 4.3879 6.2754 0.2143 5.2418 0.4026 12.6278 0.9450 21.1415 9.3737 1.3359 0.5375 1.5766 0.7633 3.2335 0.6522 39.6026 228.6481 11.0967 1.3417 118.5352 5.4474 6.8429 3.0853 4.6958 14.3614 14.9031 7.4136 31.8382 0.2247 1.1754 3.3449 3.7816 14.7590 14.1784 54.6279 17.2693 31.2045 0.3481 16.9642 10.2391 23.2535 8.0365 15.7015 16.7225 4.1174 0.2578 2.1404 40.9255 3.1132 69.8400 2.8823 10.8164 127.9181 10.3880 32.8883 5.3502 0.7429 13.4055 10.6854 17.0151 93.2824 300.0457 7.8138 655.2316 292.0359 20.7397 3.9061 26.7479 75.2400 9.6023 9.5932 17.5713 78.1432 44.8172 0.1491 14.0043 86.5789 42.0865
temp: 298.150 k
press: 1.00000 atm
elementType: 8 7 7 7 7 7 6 6 6 6 6 6 6 6 6 1 1 1 1 1 1 1 1 1 1 1 1 1
symmnumber: 1
zpe: 585794.5 jmol-1
zpe.correction: 0.223117 hartree
zpe.thermalcorrener: 0.238050 hartree
zpe.thermalcorrenthalpy: 0.238994 hartree
zpe.thermalcorrgfe: 0.179965 hartree
zpe.sumelectzpe: -698.622054 hartree
zpe.sumelectthermal: -698.607121 hartree
zpe.sumelectthermalent: -698.606177 hartree
zpe.sumelectthermalfe: -698.665206 hartree
dipole: 11.2048 6.5789 -3.5149
dipole: 13.4605
quadrupole: -112.2153 -79.1903 -90.2934
quadrupole: -17.2905 5.4085 -0.5169
quadrupole: -18.3156 14.7093 3.6063 -17.2905 5.4085 -0.5169
hfenergy: -698.8451711 hartree
pointgroup: C01 [X(C9H13N5O1)]
dipole: 4.3883168 -2.7034834 1.2160928 debye
polarizability: 171.1034258|-1.4659224|153.6356631|15.9791119|-1.4286694|81.2848077 unknown
InChI: InChI=1S/C9H13N5O/c1-2-3-4-14-5-11-6-7(14)12-9(10)13-8(6)15/h5,12H,2-4,10H2,1H3
charge 0 multiplicity 1
28 atoms
O  -3.729639 1.086413 -0.720055
N  0.769133 0.926611 0.600689
N  -0.43991 -1.252585 0.340428
N  -0.965182 2.323339 0.051313
N  -2.766751 -1.017448 -0.294373
N  -1.847701 -3.142131 0.06204
C  2.131919 0.485868 0.946978
C  2.95334 0.008493 -0.274091
C  -0.329563 0.132322 0.306389
C  4.377717 -0.437634 0.126571
C  -1.397989 0.984244 -0.025272
C  0.31937 2.259057 0.419984
C  5.208692 -0.91626 -1.082997
C  -2.716557 0.422081 -0.379204
C  -1.725629 -1.761733 0.0272
H  2.641165 1.339522 1.429649
H  2.070467 -0.316784 1.709659
H  3.010049 0.83126 -1.012382
H  2.430574 -0.828079 -0.781458
H  4.899797 0.405346 0.623024
H  4.314905 -1.251115 0.878704
H  0.980876 3.10779 0.580182
H  0.36408 -1.86225 0.495567
H  6.222029 -1.229518 -0.774066
H  4.726888 -1.777165 -1.583229
H  5.318323 -0.111606 -1.833312
H  -1.140554 -3.761633 0.448409
H  -2.766849 -3.510303 -0.171651
