program: Gaussian 09
title: 000236640
version: EM64L-G09RevD.01
frameworkgroup: C1[X(C6H13NO5)]
method: RPBEPBE
basis: SDD
operation: Freq
keyword: #p
keyword: freq=noraman
keyword: PBEPBE/SDD
title: #p freq=noraman PBEPBE/SDD
converged: YES YES NO NO
title: Mulliken charges:
elementType: O O O O O N C C C C C C H H H H H H H H H H H H H
charge: -0.492613 -0.500471 -0.446096 -0.468515 -0.413755 -0.044534 -0.105506 -0.107442 -0.066232 -0.193279 -0.711123 -0.205524 0.220315 0.265695 0.216254 0.244807 0.242780 0.202723 0.236538 0.377794 0.279739 0.381078 0.352230 0.361910 0.373229
chargesum: 0.00000
title: Mulliken charges with hydrogens summed into heavy atoms:
elementType: O O O O O N C C C C C C
charge: -0.114819 -0.119393 -0.093866 -0.106605 -0.040526 -0.044534 0.114809 0.158253 0.150021 0.051528 -0.029082 0.074214
polarizability: 1.00290037e+02 -1.14834254e+01 1.03512491e+02 4.35624664e-01 -2.90728114e-01 7.59961854e+01
1716.lowfreq: -8.2655 -0.0004 0.0002 0.0008 3.7895 12.0376 27.2022 52.2229 78.4894
frequency: 26.5973 52.1414 78.4815 101.5670 143.3140 156.5652 199.8785 216.0004 224.0648 270.5011 279.0448 298.1962 307.2785 315.1010 382.5469 431.6267 448.6288 457.6642 465.5612 509.4304 526.2538 542.2125 553.5085 647.0283 699.8030 822.1729 871.5598 890.1644 910.0164 937.3040 948.2322 966.9575 1017.4155 1034.5773 1041.4424 1093.9890 1114.7579 1116.9691 1188.7306 1193.6794 1201.9258 1221.4736 1278.5321 1281.5118 1304.8611 1309.6848 1330.6078 1339.7192 1368.9551 1372.4021 1387.1416 1390.5703 1395.7935 1466.4599 1478.3366 1592.9760 2974.7766 2985.2109 3003.0332 3022.6217 3033.6275 3081.4747 3093.6423 3104.0128 3491.5423 3502.0617 3549.4931 3559.9602 3579.3723
redmass: 5.4796 4.4728 5.2415 4.6969 5.5722 3.4762 5.5478 4.4512 1.1057 3.7010 3.4998 2.2862 4.7029 1.5362 4.5224 4.1696 1.1743 2.2208 1.3361 1.3247 2.6489 1.6241 1.9988 3.1719 3.6743 3.5245 8.2924 3.5753 2.4328 2.5242 1.9800 2.5524 2.8664 2.0712 2.6343 1.8192 1.8500 2.6176 1.2763 1.2575 1.1680 1.2260 1.2627 1.2727 1.2584 1.2799 1.2892 1.3625 1.4991 1.2308 1.2485 1.5794 1.6532 1.0534 1.0534 6.2558 1.0814 1.0386 1.0845 1.0860 1.0861 1.0974 1.0912 1.1009 1.0644 1.0649 1.0651 1.0676 1.0668
irintensity: 0.7161 2.2130 5.5984 2.0287 3.1205 3.0039 2.4785 3.4006 0.5876 7.2583 12.4492 60.3748 8.9853 102.3613 8.7470 18.0391 152.3446 42.4848 151.3151 89.1674 109.8643 112.1138 68.4414 28.8644 35.4406 31.0018 145.6618 16.0148 9.9602 18.5551 97.5519 81.4034 49.7243 28.1672 38.6495 26.6190 59.8845 28.7842 71.6022 6.1544 35.0916 14.6095 29.1393 16.2666 34.0039 10.4746 6.5667 13.6926 87.4306 45.1144 19.7195 52.3973 5.9443 12.9990 8.9072 5.1566 29.0170 25.6767 21.3595 31.4955 25.2597 37.5242 2.5820 21.8901 19.7023 41.9191 29.9216 55.9648 12.1492
temp: 298.150 k
press: 1.00000 atm
elementType: 8 8 8 8 8 7 6 6 6 6 6 6 1 1 1 1 1 1 1 1 1 1 1 1 1
symmnumber: 1
zpe: 521468.6 jmol-1
zpe.correction: 0.198617 hartree
zpe.thermalcorrener: 0.212886 hartree
zpe.thermalcorrenthalpy: 0.213830 hartree
zpe.thermalcorrgfe: 0.157404 hartree
zpe.sumelectzpe: -666.236407 hartree
zpe.sumelectthermal: -666.222138 hartree
zpe.sumelectthermalent: -666.221194 hartree
zpe.sumelectthermalfe: -666.277620 hartree
dipole: -3.4221 0.4253 -0.2629
dipole: 3.4584
quadrupole: -70.6331 -64.5217 -77.4662
quadrupole: -2.0673 7.0951 -1.1803
quadrupole: 0.2406 6.3520 -6.5926 -2.0673 7.0951 -1.1803
hfenergy: -666.4350237 hartree
pointgroup: C01 [X(C6H13N1O5)]
dipole: 1.3434066 0.2140016 0.0284312 debye
dipolederiv: -0.6456179 -0.1674332 -0.1525115 -0.1105991 -0.5498785 -0.0381512 -0.2116545 -0.0760364 -0.6365286 -0.6431678 -0.0300206 0.1130333 -0.0394312 -0.7393566 -0.2247427 0.0614762 -0.2689348 -0.4843624 -0.6575857 0.0271649 0.2478226 0.1223194 -0.6509775 0.1382431 0.2428668 0.1704766 -0.4210515 -0.5405358 0.2298628 0.0136669 0.1743517 -0.6845439 0.2356749 0.0657645 0.2725409 -0.5973523 -0.7157898 -0.3994882 0.1863321 -0.2678278 -0.5671786 0.2680313 0.5199331 0.7415 -0.4264191 0.1873031 0.4799302 -0.2110166 0.3888676 0.3246707 -0.1663306 -0.4817911 -0.5399081 0.0566855 0.3765583 0.1716186 0.1003111 0.1331252 0.2895602 -0.0163781 0.1112049 0.1041788 0.3088273 0.3125542 0.0082028 -0.1484047 -0.0406958 0.3793549 0.1901188 -0.0111271 0.1872404 0.2927466 0.4616639 0.0657831 -0.0839566 -0.0456754 0.5147677 -0.1188958 -0.1223979 -0.1287597 0.3145884 0.436105 -0.1715297 -0.0079923 -0.105003 0.4583278 -0.1537254 -0.0494204 -0.3058925 0.3526515 -0.0564525 0.1118087 -0.0404057 0.0860618 -0.1155683 0.0914821 0.0098037 0.0601595 -0.0247719 -0.1348213 -0.0255309 0.0050019 0.0308286 -0.1503836 0.116579 -0.1304142 0.0114457 0.0940725 -0.0753208 -0.0850878 0.0486814 -0.0901342 -0.0481301 0.0410263 0.0995351 0.093127 -0.0511108 0.0147445 -0.0769773 0.0670675 -0.0712416 -0.016492 0.0395532 0.0151095 0.0010991 -0.0632782 -0.0720523 -0.0609393 -0.0827444 -0.0632529 0.0228335 -0.0011205 -0.1176435 -0.0175206 -0.0297172 0.0412363 0.012455 0.001434 0.0559922 -0.0416487 -0.0751354 0.0641004 -0.0619323 -0.0561932 0.0139226 -0.0273756 -0.0915539 -0.0843835 0.0715209 -0.0559518 -0.1023024 -0.0182546 0.011853 -0.017897 -0.1127276 0.0788917 -0.0787028 -0.0169779 0.0833228 0.0642684 0.091315 0.0337519 0.0215698 0.0908687 0.0653179 0.0916783 0.0038995 -0.0700566 0.0881334 -0.0974719 -0.01461 0.3467736 0.0605743 0.0932636 0.027201 0.2617088 -0.0614081 0.1212073 -0.0498862 0.3492594 0.1604538 -0.0483943 0.0404247 -0.0403304 0.0830978 -0.0574817 0.0526401 -0.0382927 -0.0049975 0.3130554 0.136121 -0.0374579 0.1433604 0.3471414 0.0626849 -0.0371919 0.0994683 0.2546788 0.3618505 -0.0757524 -0.1131977 -0.0958471 0.2936252 -0.0214993 -0.165361 -0.0449172 0.1939018 0.1229843 -0.089732 -0.092716 -0.112618 0.2610647 -0.0784285 -0.1066852 -0.0879359 0.3495765 0.3884657 -0.0234011 0.0007086 -0.0080436 0.2695626 -0.1274107 0.019946 -0.0968082 0.1977995 unknown
polarizability: 99.5388171|11.2734223|104.0475605|-1.4960322|-2.4276355|76.2123363 unknown
InChI: InChI=1S/C6H13NO5/c1-3(8)5(10)6(11)4(9)2-7-12/h2-6,8-12H,1H3
charge 0 multiplicity 1
25 atoms
O  -2.227617 -0.69741 -1.135837
O  0.060311 -2.03265 -0.917359
O  -2.677691 0.08705 1.449922
O  1.858628 -1.804301 1.081708
O  3.196255 2.031516 -0.911185
N  2.428463 1.391643 0.156607
C  -1.123397 -0.009529 -0.445892
C  -0.207851 -1.079599 0.177182
C  -1.798925 0.90825 0.600585
C  1.128497 -0.553447 0.738236
C  -2.572005 2.059541 -0.065729
C  1.927738 0.252841 -0.255572
H  -0.546513 0.598358 -1.173785
H  -0.745486 -1.589884 1.001986
H  -1.0384 1.316482 1.290466
H  0.950521 0.052276 1.647302
H  -3.289861 1.665075 -0.806169
H  -1.883013 2.751737 -0.585862
H  -3.125321 2.626877 0.701561
H  -1.831761 -1.504464 -1.562946
H  2.08398 -0.152515 -1.267072
H  0.698636 -2.707509 -0.567904
H  -3.221119 -0.456335 0.816091
H  2.740351 -1.574261 1.468596
H  3.506883 2.871954 -0.48463
