program: Gaussian 09
title: 000236634
version: EM64L-G09RevD.01
frameworkgroup: C1[X(C8H12ClN3O2)]
method: RPBEPBE
basis: SDD
operation: Freq
keyword: #p
keyword: freq=noraman
keyword: PBEPBE/SDD
title: #p freq=noraman PBEPBE/SDD
converged: NO YES NO NO
title: Mulliken charges:
elementType: Cl O O N N N C C C C C C C C H H H H H H H H H H H H
charge: -0.066691 -0.263331 -0.254913 -0.175416 -0.392714 -0.355372 -0.360584 -0.418970 0.321811 -0.590663 -0.658004 0.142322 -0.258187 0.132034 0.250852 0.223338 0.212031 0.302291 0.284466 0.281278 0.226340 0.213925 0.226418 0.266521 0.364649 0.346568
chargesum: 0.00000
title: Mulliken charges with hydrogens summed into heavy atoms:
elementType: Cl O O N N N C C C C C C C C
charge: -0.066691 -0.263331 -0.254913 -0.175416 -0.028065 -0.008804 0.113606 0.095353 0.321811 -0.024919 0.008680 0.142322 0.008334 0.132034
polarizability: 1.62365253e+02 1.37760640e+01 1.39546119e+02 5.37166480e+00 -1.75081369e+01 8.42676554e+01
1716.lowfreq: -7.1711 0.0016 0.0017 0.0020 2.2239 8.9578 35.0474 38.3433 52.1219
frequency: 34.9115 38.2393 52.0333 64.9686 94.1776 147.2955 164.0741 201.1648 215.5256 246.2024 262.1940 324.1097 360.9843 365.4968 395.2769 410.3685 491.8423 505.4029 535.9354 605.4300 615.2047 660.0590 689.2778 691.8680 731.4791 753.9222 780.9671 785.4083 796.4406 813.4026 892.6855 956.1458 983.1080 1016.2184 1044.5134 1074.5646 1105.1952 1124.2528 1175.4352 1197.1384 1211.3484 1254.9667 1262.3384 1285.6409 1333.4683 1339.4406 1352.4981 1365.2022 1372.0433 1382.5093 1400.4721 1442.4778 1458.9898 1467.2534 1475.3603 1485.2586 1507.6360 1607.5436 1620.2756 1685.7575 2946.7465 2975.5595 3012.1331 3065.3100 3071.0869 3076.4827 3080.9319 3107.8347 3155.9261 3192.9919 3526.0297 3569.5050
redmass: 8.3332 5.3426 3.4238 4.2159 3.6089 3.2625 7.7646 1.2404 5.8328 3.3933 2.7773 4.8696 9.3056 3.5307 4.0007 4.3115 3.9794 3.6626 6.9529 5.0247 1.2278 5.4818 2.9126 3.8382 4.2070 5.2522 1.9789 1.1512 1.2323 1.3920 2.5191 3.3774 2.7999 1.5286 3.6442 2.2035 1.7392 2.8537 1.7912 3.0607 2.3059 1.2936 1.5004 1.2065 1.4988 1.7891 1.3085 1.7803 1.7574 1.2109 2.2942 2.4845 1.0935 1.0468 1.0459 1.0836 1.1122 5.7640 5.4743 5.5451 1.0709 1.0357 1.0680 1.0991 1.0612 1.0869 1.0984 1.0990 1.1115 1.0922 1.0769 1.0784
irintensity: 4.0602 2.9294 0.1389 0.8290 1.2072 0.7163 2.1905 0.4786 6.4676 2.0464 2.7613 0.4064 22.3746 7.1329 5.1585 13.4906 3.2073 4.8528 12.2867 2.6858 89.8754 21.5873 17.2058 47.8413 30.3271 33.1817 102.3652 5.1591 8.9624 64.5535 1.1599 11.6147 22.5937 5.9187 3.6473 17.5252 36.5716 27.7269 65.7015 16.7713 42.0448 77.5038 67.5412 44.1762 75.8970 30.7401 6.9821 11.5528 34.4685 19.5220 25.9509 0.8963 10.2059 12.6283 1.9576 48.7771 21.4933 241.3630 226.3514 713.9786 33.4240 25.7805 44.5564 29.4329 11.2852 11.5793 51.7332 7.8336 9.7606 11.6039 62.5199 83.1409
temp: 298.150 k
press: 1.00000 atm
elementType: 17 8 8 7 7 7 6 6 6 6 6 6 6 6 1 1 1 1 1 1 1 1 1 1 1 1
symmnumber: 1
zpe: 535292.6 jmol-1
zpe.correction: 0.203882 hartree
zpe.thermalcorrener: 0.218150 hartree
zpe.thermalcorrenthalpy: 0.219094 hartree
zpe.thermalcorrgfe: 0.160784 hartree
zpe.sumelectzpe: -1085.767100 hartree
zpe.sumelectthermal: -1085.752832 hartree
zpe.sumelectthermalent: -1085.751888 hartree
zpe.sumelectthermalfe: -1085.810198 hartree
dipole: 2.5706 0.6946 1.8865
dipole: 3.2633
quadrupole: -112.8703 -91.5613 -90.3444
quadrupole: 1.3802 -0.6138 1.0195
quadrupole: -14.6116 6.6973 7.9143 1.3802 -0.6138 1.0195
hfenergy: -1085.9709822 hartree
pointgroup: C01 [X(C8H12Cl1N3O2)]
dipole: 1.0117636 -0.4105611 -0.6753697 debye
dipolederiv: -0.3370535 -0.1481081 0.1505518 -0.1861442 -0.3616758 0.1360557 0.2929774 0.2539496 -0.4269722 -0.6458149 0.0750726 -0.1071175 0.1125382 -0.407965 0.1701006 -0.2522063 0.1963978 -1.1499316 -1.7379266 0.0844344 -0.1148557 0.0973185 -0.4025668 0.0329779 -0.0838285 0.0251637 -0.4699576 -1.377846 0.0656736 -0.1016934 -0.2264555 -0.6576948 0.1338157 -0.1432053 0.1687133 -0.4605814 -0.9184889 0.1058091 -0.3587083 0.0949756 -0.3659456 0.0864782 -0.3683456 0.0841811 -0.5482916 -1.2468074 0.1397771 -0.3914756 -0.0980176 -0.2939789 0.0613842 0.6302519 0.0114562 -0.4242779 0.3310185 0.128202 -0.0661805 0.2605171 0.3340509 -0.1567048 -0.2797233 0.0327072 0.2393033 0.2452528 -0.2089094 0.2102003 -0.1483677 0.5641886 -0.0984372 0.4181858 -0.2246248 0.2879986 1.2406694 -0.0733613 0.287174 -0.063866 -0.081126 0.2094259 0.3492526 0.2630093 -0.5541878 0.3342413 0.1760361 -0.2511691 0.230706 0.2842696 -0.188617 -0.3343195 -0.3523833 0.5515323 0.025855 0.0535432 -0.0624359 0.0932827 -0.1954158 -0.0065308 -0.0808874 -0.0419186 0.0132907 1.0070354 -0.0387534 0.0885147 -0.1970153 0.325175 -0.2965069 0.3357591 -0.2970466 1.4135801 0.5092755 -0.1696923 0.5684074 0.1200587 -0.1253258 -0.1029992 -0.3306801 -0.1138708 0.2151606 2.2778567 -0.1295049 0.185814 -0.0082991 0.3532844 -0.1828766 -0.2782104 -0.156961 0.877735 -0.0860977 0.0702593 -0.0076193 0.0434556 0.0362621 0.0144366 -0.0400437 0.0166225 0.0888905 0.0329601 -0.0501804 -0.0878668 -0.0603286 -0.0030126 -0.0423669 0.0733768 -0.0433993 -0.1332279 -0.1534116 -0.0402415 -0.1047565 -0.0615681 -0.0375853 -0.0243823 -0.0309765 -0.0148575 0.0921736 0.2086958 -0.0473478 0.0901208 -0.0191512 0.0327874 0.0135847 -0.0088377 0.035503 0.0108803 -0.0707528 0.0810352 0.038079 0.0370132 0.0592233 0.023131 0.0327682 0.038185 0.0133967 0.0223159 -0.0726633 0.0011179 -0.0422392 0.0369532 0.0211478 -0.0288202 -0.0320118 -0.0849014 -0.1008606 -0.1022874 -0.0401722 -0.0529287 0.0568083 -0.0308514 -0.0315645 -0.0364717 0.0642858 0.0129164 0.0013927 0.1072962 -0.0350525 0.0768387 0.019817 0.1308481 -0.0316601 -0.0939454 0.0416886 0.0898791 -0.0709078 0.1227905 -0.0601346 0.1131765 -0.0789227 0.1100222 -0.0056708 0.0389562 -0.0106626 0.0590519 -0.0293021 0.1693281 0.0356392 0.0929534 0.0528491 0.0162488 0.1875555 0.0155329 -0.0412917 0.0257459 0.3258694 0.0277234 -0.0497133 0.033679 0.2018078 0.1587666 0.0050648 0.0199223 -0.0096661 0.337388 0.0313787 0.0639118 0.0227666 0.2656617 unknown
polarizability: 168.900537|-0.8408389|91.6928819|0.606339|-25.2794504|125.5856087 unknown
InChI: InChI=1S/C8H12ClN3O2/c1-2-12(4-3-9)6-5-10-8(14)11-7(6)13/h5,10-11H,2-4H2,1H3
charge 0 multiplicity 1
26 atoms
Cl 3.179632 2.421876 -2.531208
O  -0.540642 -0.693917 2.239101
O  -4.167894 0.101384 -0.585406
N  1.395851 -0.275727 0.052756
N  -2.28606 -0.361845 0.755594
N  -1.994434 0.261766 -1.464816
C  2.254398 0.234504 -1.032451
C  2.020634 -1.291498 0.951326
C  -0.004693 -0.222191 -0.120995
C  2.278498 1.772443 -0.998397
C  2.121937 -2.694013 0.309998
C  -0.900267 -0.44654 1.04893
C  -0.607943 0.129099 -1.324474
C  -2.917778 0.006701 -0.447422
H  3.277138 -0.145857 -0.875618
H  1.945813 -0.121339 -2.038829
H  3.027501 -0.916536 1.212447
H  1.432155 -1.334845 1.879372
H  1.272702 2.214596 -1.035573
H  2.834282 2.156147 -0.132029
H  1.118042 -3.094912 0.080478
H  2.711484 -2.680589 -0.626116
H  2.613871 -3.394039 1.010233
H  -0.036364 0.336235 -2.229838
H  -2.912007 -0.529891 1.549924
H  -2.394956 0.551684 -2.358088
